[aarch64-port-dev ] Linaro OpenJDK AArch64 jdk/jdk build 1339 Failure
ci_notify at linaro.org
ci_notify at linaro.org
Wed May 8 19:11:15 UTC 2019
OpenJDK AArch64 jdk/jdk build status is Failure
Build details - https://ci.linaro.org/job/jdkX-ci-build/1339/
Changes -
rkennke: 1321f8cf9de5c48acf799777a2fb54baff8c11d7
- src/hotspot/share/gc/shenandoah/shenandoahForwarding.hpp
- src/hotspot/share/gc/shenandoah/shenandoahForwarding.inline.hpp
- src/hotspot/cpu/aarch64/gc/shenandoah/shenandoahBarrierSetAssembler_aarch64.cpp
- src/hotspot/cpu/x86/gc/shenandoah/shenandoahBarrierSetAssembler_x86.cpp
- src/hotspot/share/gc/shenandoah/c1/shenandoahBarrierSetC1.cpp
- src/hotspot/share/gc/shenandoah/c2/shenandoahBarrierSetC2.cpp
- src/hotspot/share/gc/shenandoah/c2/shenandoahSupport.cpp
- src/hotspot/share/gc/shenandoah/c2/shenandoahSupport.hpp
- src/hotspot/share/gc/shenandoah/shenandoahAsserts.cpp
- src/hotspot/share/gc/shenandoah/shenandoahBarrierSet.cpp
- src/hotspot/share/gc/shenandoah/shenandoahBarrierSet.inline.hpp
- src/hotspot/share/gc/shenandoah/shenandoahBarrierSetAssembler.hpp
- src/hotspot/share/gc/shenandoah/shenandoahConcurrentMark.inline.hpp
- src/hotspot/share/gc/shenandoah/shenandoahHeap.cpp
- src/hotspot/share/gc/shenandoah/shenandoahHeap.inline.hpp
- src/hotspot/share/gc/shenandoah/shenandoahHeapRegion.cpp
- src/hotspot/share/gc/shenandoah/shenandoahHeuristics.cpp
- src/hotspot/share/gc/shenandoah/shenandoahMarkCompact.cpp
- src/hotspot/share/gc/shenandoah/shenandoahTraversalGC.cpp
- src/hotspot/share/gc/shenandoah/shenandoahVerifier.cpp
- src/hotspot/share/gc/shenandoah/shenandoahBrooksPointer.hpp
- src/hotspot/share/gc/shenandoah/shenandoahBrooksPointer.inline.hpp
--"8223567: Rename ShenandoahBrooksPointer to ShenandoahForwarding
Reviewed-by: shade
"
Build output -
Building target 'images' in configuration '/home/buildslave/workspace/jdkX-ci-build/build'
Compiling 8 files for BUILD_TOOLS_LANGTOOLS
Compiling 1 files for BUILD_JFR_TOOLS
Creating hotspot/variant-server/tools/adlc/adlc from 13 file(s)
Compiling 2 files for BUILD_JVMTI_TOOLS
Parsing 2 properties into enum-like class for jdk.compiler
Compiling 10 properties into resource bundles for jdk.javadoc
Compiling 12 properties into resource bundles for jdk.jdeps
Compiling 19 properties into resource bundles for jdk.compiler
Compiling 7 properties into resource bundles for jdk.jshell
Compiling 117 files for BUILD_java.compiler.interim
Creating support/modules_libs/java.base/server/libjvm.so from 920 file(s)
Creating hotspot/variant-server/libjvm/gtest/libjvm.so from 113 file(s)
Creating hotspot/variant-server/libjvm/gtest/gtestLauncher from 1 file(s)
Compiling 400 files for BUILD_jdk.compiler.interim
Compiling 218 files for BUILD_jdk.javadoc.interim
Compiling 162 files for BUILD_TOOLS_JDK
Note: Some input files use or override a deprecated API.
Note: Recompile with -Xlint:deprecation for details.
Note: Some input files use unchecked or unsafe operations.
Note: Recompile with -Xlint:unchecked for details.
Compiling 2 files for COMPILE_DEPEND
Compiling 3 files for BUILD_VM_COMPILER_MATCH_PROCESSOR
Compiling 188 files for BUILD_jdk.rmic.interim
Compiling 5 files for BUILD_VM_COMPILER_NODEINFO_PROCESSOR
Compiling 3 files for BUILD_VM_COMPILER_OPTIONS_PROCESSOR
Compiling 14 files for BUILD_VM_COMPILER_REPLACEMENTS_PROCESSOR
Compiling 31 files for BUILD_JRTFS
Compiling 3 files for BUILD_VM_COMPILER_SERVICEPROVIDER_PROCESSOR
Note: Some input files use or override a deprecated API.
Note: Recompile with -Xlint:deprecation for details.
Creating buildtools/jdk.vm.compiler.match.processor.jar
Creating buildtools/jdk.vm.compiler.nodeinfo.processor.jar
Creating support/modules_libs/java.base/jrt-fs.jar
Creating buildtools/jdk.vm.compiler.options.processor.jar
Creating buildtools/jdk.vm.compiler.replacements.verifier.jar
Compiling 2 files for BUILD_BREAKITERATOR_BASE
Compiling 2 files for BUILD_BREAKITERATOR_LD
Creating buildtools/jdk.vm.compiler.serviceprovider.processor.jar
Compiling 11 properties into resource bundles for java.logging
Compiling 11 properties into resource bundles for jdk.jartool
Compiling 11 properties into resource bundles for jdk.management.agent
Compiling 3 properties into resource bundles for jdk.jdi
Compiling 4 properties into resource bundles for jdk.jlink
Compiling 3 properties into resource bundles for jdk.jlink
Compiling 224 properties into resource bundles for jdk.localedata
Compiling 1 properties into resource bundles for jdk.jlink
Compiling 11 properties into resource bundles for java.base
/home/buildslave/workspace/jdkX-ci-build/jdkX/src/hotspot/share/gc/shenandoah/shenandoahVerifier.cpp: In member function ‘void ShenandoahVerifyNoForwared::do_oop_work(T*)’:
/home/buildslave/workspace/jdkX-ci-build/jdkX/src/hotspot/share/gc/shenandoah/shenandoahVerifier.cpp:930:23: error: ‘ShenandoahBrooksPointer’ has not been declared
oop fwd = (oop) ShenandoahBrooksPointer::get_raw_unchecked(obj);
^
At global scope:
cc1plus: error: unrecognized command line option ‘-Wno-misleading-indentation’ [-Werror]
cc1plus: error: unrecognized command line option ‘-Wno-implicit-fallthrough’ [-Werror]
cc1plus: error: unrecognized command line option ‘-Wno-int-in-bool-context’ [-Werror]
cc1plus: all warnings being treated as errors
lib/CompileJvm.gmk:175: recipe for target '/home/buildslave/workspace/jdkX-ci-build/build/hotspot/variant-server/libjvm/objs/shenandoahVerifier.o' failed
make[3]: *** [/home/buildslave/workspace/jdkX-ci-build/build/hotspot/variant-server/libjvm/objs/shenandoahVerifier.o] Error 1
make[3]: *** Waiting for unfinished jobs....
Compiling 6 properties into resource bundles for java.base
Compiling 89 properties into resource bundles for java.desktop
Compiling 3014 files for java.base
make/Main.gmk:257: recipe for target 'hotspot-server-libs' failed
make[2]: *** [hotspot-server-libs] Error 1
make[2]: *** Waiting for unfinished jobs....
ERROR: Build failed for target 'images' in configuration '/home/buildslave/workspace/jdkX-ci-build/build' (exit code 2)
Stopping sjavac server
=== Output from failing command(s) repeated here ===
* For target hotspot_variant-server_libjvm_objs_shenandoahVerifier.o:
/home/buildslave/workspace/jdkX-ci-build/jdkX/src/hotspot/share/gc/shenandoah/shenandoahVerifier.cpp: In member function ‘void ShenandoahVerifyNoForwared::do_oop_work(T*)’:
/home/buildslave/workspace/jdkX-ci-build/jdkX/src/hotspot/share/gc/shenandoah/shenandoahVerifier.cpp:930:23: error: ‘ShenandoahBrooksPointer’ has not been declared
oop fwd = (oop) ShenandoahBrooksPointer::get_raw_unchecked(obj);
^
At global scope:
cc1plus: error: unrecognized command line option ‘-Wno-misleading-indentation’ [-Werror]
cc1plus: error: unrecognized command line option ‘-Wno-implicit-fallthrough’ [-Werror]
cc1plus: error: unrecognized command line option ‘-Wno-int-in-bool-context’ [-Werror]
cc1plus: all warnings being treated as errors
* All command lines available in /home/buildslave/workspace/jdkX-ci-build/build/make-support/failure-logs.
=== End of repeated output ===
=== Make failed targets repeated here ===
lib/CompileJvm.gmk:175: recipe for target '/home/buildslave/workspace/jdkX-ci-build/build/hotspot/variant-server/libjvm/objs/shenandoahVerifier.o' failed
make/Main.gmk:257: recipe for target 'hotspot-server-libs' failed
=== End of repeated output ===
Hint: Try searching the build log for the name of the first failed target.
Hint: See doc/building.html#troubleshooting for assistance.
/home/buildslave/workspace/jdkX-ci-build/jdkX/make/Init.gmk:307: recipe for target 'main' failed
make[1]: *** [main] Error 1
/home/buildslave/workspace/jdkX-ci-build/jdkX/make/Init.gmk:186: recipe for target 'images' failed
make: *** [images] Error 2
More information about the aarch64-port-dev
mailing list