RFR(s): 8171958: Several tests from java/time/test/java/time/format requiring jdk.localedata for execution
Sergei Kovalev
sergei.kovalev at oracle.com
Tue Dec 27 08:59:40 UTC 2016
Hi Nadeesh,
I cannot say for sure does tck tests have same issue or not because now
they broken and failing as with limited JRE as well with full JDK. To
make sure if we have same issue with tck tests we need to fix them
first. I can take a look at the problem in separate CR. An example of
failure you can find in attachment.
27.12.16 09:04, nadeesh tv wrote:
> Hi Sergei,
>
> I could see you modified tests only in
> /test/java/time/*test*/java/time/format/ directory.
>
> Won't the tests from test/java/time/*tck*/java/time/format/ directory
> fail with same issue?
>
> Thanks and Regards,
> Nadeesh
>
> On 12/26/2016 8:27 PM, Sergei Kovalev wrote:
>> Hello Team,
>>
>> Please review below fix for tests.
>>
>> Bug ID: https://bugs.openjdk.java.net/browse/JDK-8171958
>> Web review: http://cr.openjdk.java.net/~skovalev/8171958/webrev.00/
>>
>> Issue: some tests fails in case of module limitation by
>> '--limit-module java.base' command line option.
>> Root cause: The tests uses locale data that stored in separate
>> resource file "jdk.localedata".
>> Solution: Add declaration of required module. In same cases a test
>> file contains many test items, part of which could be executed with
>> java.base module only. In this cases we can separate the items and
>> extract that items which depend on locale data and run them
>> individually. Therefore this proposal contains additional test files
>> where added "WithLocale" suffix which demonstrate dependency on
>> resources. Alternative solution could be add a required module
>> declaration "jdk.localedata" to all files. However this will lead to
>> unnecessary test coverage reduction.
>>
>
> --
> Thanks and Regards,
> Nadeesh TV
>
--
With best regards,
Sergei
-------------- next part --------------
#Test Results (version 2)
#Thu Dec 22 20:55:18 MSK 2016
#-----testdescription-----
$file=/var/www/hudson/ws/workspace/MinimalDepsRun/jake/jdk/test/java/time/tck/java/time/format/TCKDateTimeParseResolver.java
$root=/var/www/hudson/ws/workspace/MinimalDepsRun/jake/jdk/test
keywords=testng
library=/lib/testlibrary/
modules=java.base/java.time\:open java.base/java.time.chrono\:open java.base/java.time.zone\:open
packageRoot=java/time/
run=ASSUMED_ACTION testng tck.java.time.format.TCKDateTimeParseResolver\n
source=TCKDateTimeParseResolver.java
testngClass=tck.java.time.format.TCKDateTimeParseResolver
title=\
#-----environment-----
#-----testresult-----
description=file\:/var/www/hudson/ws/workspace/MinimalDepsRun/jake/jdk/test/java/time/tck/java/time/format/TCKDateTimeParseResolver.java
elapsed=33384 0\:00\:33.384
end=Thu Dec 22 20\:55\:18 MSK 2016
environment=regtest
execStatus=Failed. Execution failed\: `main' threw exception\: java.lang.Exception\: failures\: 19
harnessLoaderMode=Classpath Loader
harnessVariety=Full Bundle
hostname=slowpoke.ru.oracle.com
javatestOS=Linux 3.2.0-38-generic (amd64)
javatestVersion=4.6
jtregVersion=jtreg 4.2 fcs b05
modules=java.base/java.time\:open java.base/java.time.chrono\:open java.base/java.time.zone\:open
script=com.sun.javatest.regtest.exec.RegressionScript
sections=script_messages build compile compile testng
start=Thu Dec 22 20\:54\:45 MSK 2016
test=java/time/tck/java/time/format/TCKDateTimeParseResolver.java
testJDK=/var/www/hudson/ws/workspace/MinimalDepsRun/jake/build/linux-x64/images/jdk
totalTime=33389
user.name=hudson
work=/var/www/hudson/ws/workspace/MinimalDepsRun/jake/jdk/test/JTwork-java-time-tck-java-time-format-TCKDateTimeParseResolver-java_0/java/time/tck/java/time/format
#section:script_messages
----------messages:(7/607)----------
JDK under test: /var/www/hudson/ws/workspace/MinimalDepsRun/jake/build/linux-x64/images/jdk
java version "9-internal"
Java(TM) SE Runtime Environment (build 9-internal+0-2016-12-21-165144.hudson.jake)
Java HotSpot(TM) 64-Bit Server VM (build 9-internal+0-2016-12-21-165144.hudson.jake, mixed mode)
Library /lib/testlibrary/; kind: packages
source directory: /var/www/hudson/ws/workspace/MinimalDepsRun/jake/jdk/test/lib/testlibrary
class directory: /var/www/hudson/ws/workspace/MinimalDepsRun/jake/jdk/test/JTwork-java-time-tck-java-time-format-TCKDateTimeParseResolver-java_0/classes/lib/testlibrary
#section:build
----------messages:(7/14072)----------
command: build jdk.testlibrary.RandomFactory tck.java.time.AbstractDateTimeTest tck.java.time.TCKZonedDateTime tck.java.time.TCKZoneId tck.java.time.TCKYear tck.java.time.format.TCKDateTimeFormatter tck.java.time.format.TCKLocalizedFieldParser tck.java.time.format.TCKChronoPrinterParser tck.java.time.format.TCKPadPrinterParser tck.java.time.format.TCKInstantPrinterParser tck.java.time.format.TCKDecimalStyle tck.java.time.format.TCKDateTimeFormatters tck.java.time.format.TCKDateTimeParseResolver tck.java.time.format.TCKDateTimeTextPrinting tck.java.time.format.TCKZoneIdPrinterParser tck.java.time.format.TCKOffsetPrinterParser tck.java.time.format.TCKLocalizedPrinterParser tck.java.time.format.TCKLocalizedOffsetIdPrinterParser tck.java.time.format.TCKDTFParsedInstant tck.java.time.format.TCKSignStyle tck.java.time.format.TCKFormatStyle tck.java.time.format.TCKResolverStyle tck.java.time.format.TCKLocalizedFieldPrinter tck.java.time.format.TCKTextStyle tck.java.time.format.TCKDateTimeFormatterBuilder tck.java.time.TestIsoChronology tck.java.time.TCKMonth tck.java.time.TCKLocalDateTime tck.java.time.temporal.TCKTemporalAdjusters tck.java.time.temporal.TCKJulianFields tck.java.time.temporal.TCKIsoFields tck.java.time.temporal.serial.TCKJulianFieldsSerialization tck.java.time.temporal.serial.TCKValueRangeSerialization tck.java.time.temporal.serial.TCKWeekFieldsSerialization tck.java.time.temporal.serial.TCKChronoFieldSerialization tck.java.time.temporal.serial.TCKChronoUnitSerialization tck.java.time.temporal.TCKChronoField tck.java.time.temporal.TCKChronoUnit tck.java.time.temporal.TCKWeekFields tck.java.time.TCKClock_Tick tck.java.time.TCKClock_Fixed tck.java.time.serial.TCKZoneOffsetSerialization tck.java.time.serial.TCKDurationSerialization tck.java.time.serial.TCKZoneIdSerialization tck.java.time.serial.TCKLocalDateSerialization tck.java.time.serial.TCKLocalDateTimeSerialization tck.java.time.serial.TCKClockSerialization tck.java.time.serial.TCKOffsetTimeSerialization tck.java.time.serial.TCKZonedDateTimeSerialization tck.java.time.serial.TCKYearMonthSerialization tck.java.time.serial.TCKOffsetDateTimeSerialization tck.java.time.serial.TCKInstantSerialization tck.java.time.serial.TCKLocalTimeSerialization tck.java.time.serial.TCKMonthDaySerialization tck.java.time.serial.TCKYearSerialization tck.java.time.serial.TCKPeriodSerialization tck.java.time.TCKYearMonth tck.java.time.TCKOffsetDateTime tck.java.time.TCKClock tck.java.time.TCKDayOfWeek tck.java.time.MockSimplePeriod tck.java.time.TCKPeriod tck.java.time.TCKOffsetTime tck.java.time.TCKDuration tck.java.time.chrono.TCKHijrahEra tck.java.time.chrono.CopticEra tck.java.time.chrono.TCKTestServiceLoader tck.java.time.chrono.CopticDate tck.java.time.chrono.TCKJapaneseChronology tck.java.time.chrono.TCKChronoPeriod tck.java.time.chrono.TCKThaiBuddhistChronology tck.java.time.chrono.TCKIsoChronology tck.java.time.chrono.serial.TCKChronoZonedDateTimeSerialization tck.java.time.chrono.serial.TCKChronoLocalDateTimeSerialization tck.java.time.chrono.serial.TCKEraSerialization tck.java.time.chrono.serial.TCKChronologySerialization tck.java.time.chrono.serial.TCKCopticSerialization tck.java.time.chrono.serial.TCKChronoLocalDateSerialization tck.java.time.chrono.TCKThaiBuddhistEra tck.java.time.chrono.CopticChronology tck.java.time.chrono.TCKChronology tck.java.time.chrono.TCKChronoLocalDate tck.java.time.chrono.TCKChronoZonedDateTime tck.java.time.chrono.TCKMinguoEra tck.java.time.chrono.TCKIsoEra tck.java.time.chrono.TCKMinguoChronology tck.java.time.chrono.TCKChronoLocalDateTime tck.java.time.chrono.TCKJapaneseEra tck.java.time.chrono.TCKHijrahChronology tck.java.time.TCKLocalDate tck.java.time.TCKLocalTime tck.java.time.TCKClock_Offset tck.java.time.TCKInstant tck.java.time.TCKZoneOffset tck.java.time.zone.TCKZoneOffsetTransitionRule tck.java.time.zone.TCKZoneRulesProvider tck.java.time.zone.TCKZoneRules tck.java.time.zone.serial.TCKFixedZoneRulesSerialization tck.java.time.zone.serial.TCKZoneOffsetTransitionRuleSerialization tck.java.time.zone.serial.TCKZoneOffsetTransitionSerialization tck.java.time.zone.serial.TCKZoneRulesSerialization tck.java.time.zone.TCKFixedZoneRules tck.java.time.zone.TCKZoneOffsetTransition tck.java.time.AbstractTCKTest tck.java.time.TCKMonthDay tck.java.time.TCKClock_System test.java.util.TestFormatter test.java.time.format.TestZoneTextPrinterParser test.java.time.format.TestNarrowMonthNamesAndDayNames test.java.time.format.TestTextParser test.java.time.format.MockIOExceptionAppendable test.java.time.format.TestStringLiteralPrinter test.java.time.format.AbstractTestPrinterParser test.java.time.format.TestNonIsoFormatter test.java.time.format.TestNumberParser test.java.time.format.TestZoneOffsetPrinter test.java.time.format.TestCharLiteralPrinter test.java.time.format.TestSettingsParser test.java.time.format.TestDateTimeTextProvider test.java.time.format.TestNumberPrinter test.java.time.format.ZoneName test.java.time.format.TestReducedParser test.java.time.format.TestCharLiteralParser test.java.time.format.TestFractionPrinterParser test.java.time.format.TestStringLiteralParser test.java.time.format.TestPadPrinterDecorator test.java.time.format.TestReducedPrinter test.java.time.format.TestTextPrinter test.java.time.format.TestDateTimeFormatterBuilder test.java.time.format.TestDateTimeParsing test.java.time.format.TestDateTimeFormatter test.java.time.format.TestDecimalStyle test.java.time.format.TestZoneOffsetParser test.java.time.TestMonthDay test.java.time.TestZonedDateTime test.java.time.TestLocalTime test.java.time.temporal.MockFieldValue test.java.time.temporal.TestDateTimeBuilderCombinations test.java.time.temporal.TestDateTimeValueRange test.java.time.temporal.TestChronoField test.java.time.temporal.TestChronoUnit test.java.time.temporal.MockFieldNoValue test.java.time.temporal.TestJulianFields test.java.time.temporal.TestIsoWeekFields test.java.time.TestYearMonth test.java.time.TestYear test.java.time.TestLocalDateTime test.java.time.TestClock_Fixed test.java.time.TestPeriod test.java.time.TestLocalDate test.java.time.TestZoneOffset test.java.time.AbstractTest test.java.time.MockSimplePeriod test.java.time.chrono.TestIsoChronoImpl test.java.time.chrono.TestChronoLocalDate test.java.time.chrono.TestUmmAlQuraChronology test.java.time.chrono.TestJapaneseChronology test.java.time.chrono.TestServiceLoader test.java.time.chrono.TestJapaneseChronoImpl test.java.time.chrono.TestChronologyPerf test.java.time.chrono.TestThaiBuddhistChronoImpl test.java.time.chrono.TestExampleCode test.java.time.TestDuration test.java.time.TestZoneId test.java.time.TestOffsetDateTime_instants test.java.time.TestOffsetTime test.java.time.zone.TestFixedZoneRules test.java.time.TestClock_Offset test.java.time.TestOffsetDateTime test.java.time.TestClock_Tick test.java.time.TestClock_System test.java.time.TestInstant
reason: Named class compiled on demand
Library /lib/testlibrary/:
compile: jdk.testlibrary.RandomFactory
Test directory:
compile: tck.java.time.AbstractDateTimeTest, tck.java.time.TCKZonedDateTime, tck.java.time.TCKZoneId, tck.java.time.TCKYear, tck.java.time.format.TCKDateTimeFormatter, tck.java.time.format.TCKLocalizedFieldParser, tck.java.time.format.TCKChronoPrinterParser, tck.java.time.format.TCKPadPrinterParser, tck.java.time.format.TCKInstantPrinterParser, tck.java.time.format.TCKDecimalStyle, tck.java.time.format.TCKDateTimeFormatters, tck.java.time.format.TCKDateTimeParseResolver, tck.java.time.format.TCKDateTimeTextPrinting, tck.java.time.format.TCKZoneIdPrinterParser, tck.java.time.format.TCKOffsetPrinterParser, tck.java.time.format.TCKLocalizedPrinterParser, tck.java.time.format.TCKLocalizedOffsetIdPrinterParser, tck.java.time.format.TCKDTFParsedInstant, tck.java.time.format.TCKSignStyle, tck.java.time.format.TCKFormatStyle, tck.java.time.format.TCKResolverStyle, tck.java.time.format.TCKLocalizedFieldPrinter, tck.java.time.format.TCKTextStyle, tck.java.time.format.TCKDateTimeFormatterBuilder, tck.java.time.TestIsoChronology, tck.java.time.TCKMonth, tck.java.time.TCKLocalDateTime, tck.java.time.temporal.TCKTemporalAdjusters, tck.java.time.temporal.TCKJulianFields, tck.java.time.temporal.TCKIsoFields, tck.java.time.temporal.serial.TCKJulianFieldsSerialization, tck.java.time.temporal.serial.TCKValueRangeSerialization, tck.java.time.temporal.serial.TCKWeekFieldsSerialization, tck.java.time.temporal.serial.TCKChronoFieldSerialization, tck.java.time.temporal.serial.TCKChronoUnitSerialization, tck.java.time.temporal.TCKChronoField, tck.java.time.temporal.TCKChronoUnit, tck.java.time.temporal.TCKWeekFields, tck.java.time.TCKClock_Tick, tck.java.time.TCKClock_Fixed, tck.java.time.serial.TCKZoneOffsetSerialization, tck.java.time.serial.TCKDurationSerialization, tck.java.time.serial.TCKZoneIdSerialization, tck.java.time.serial.TCKLocalDateSerialization, tck.java.time.serial.TCKLocalDateTimeSerialization, tck.java.time.serial.TCKClockSerialization, tck.java.time.serial.TCKOffsetTimeSerialization, tck.java.time.serial.TCKZonedDateTimeSerialization, tck.java.time.serial.TCKYearMonthSerialization, tck.java.time.serial.TCKOffsetDateTimeSerialization, tck.java.time.serial.TCKInstantSerialization, tck.java.time.serial.TCKLocalTimeSerialization, tck.java.time.serial.TCKMonthDaySerialization, tck.java.time.serial.TCKYearSerialization, tck.java.time.serial.TCKPeriodSerialization, tck.java.time.TCKYearMonth, tck.java.time.TCKOffsetDateTime, tck.java.time.TCKClock, tck.java.time.TCKDayOfWeek, tck.java.time.MockSimplePeriod, tck.java.time.TCKPeriod, tck.java.time.TCKOffsetTime, tck.java.time.TCKDuration, tck.java.time.chrono.TCKHijrahEra, tck.java.time.chrono.CopticEra, tck.java.time.chrono.TCKTestServiceLoader, tck.java.time.chrono.CopticDate, tck.java.time.chrono.TCKJapaneseChronology, tck.java.time.chrono.TCKChronoPeriod, tck.java.time.chrono.TCKThaiBuddhistChronology, tck.java.time.chrono.TCKIsoChronology, tck.java.time.chrono.serial.TCKChronoZonedDateTimeSerialization, tck.java.time.chrono.serial.TCKChronoLocalDateTimeSerialization, tck.java.time.chrono.serial.TCKEraSerialization, tck.java.time.chrono.serial.TCKChronologySerialization, tck.java.time.chrono.serial.TCKCopticSerialization, tck.java.time.chrono.serial.TCKChronoLocalDateSerialization, tck.java.time.chrono.TCKThaiBuddhistEra, tck.java.time.chrono.CopticChronology, tck.java.time.chrono.TCKChronology, tck.java.time.chrono.TCKChronoLocalDate, tck.java.time.chrono.TCKChronoZonedDateTime, tck.java.time.chrono.TCKMinguoEra, tck.java.time.chrono.TCKIsoEra, tck.java.time.chrono.TCKMinguoChronology, tck.java.time.chrono.TCKChronoLocalDateTime, tck.java.time.chrono.TCKJapaneseEra, tck.java.time.chrono.TCKHijrahChronology, tck.java.time.TCKLocalDate, tck.java.time.TCKLocalTime, tck.java.time.TCKClock_Offset, tck.java.time.TCKInstant, tck.java.time.TCKZoneOffset, tck.java.time.zone.TCKZoneOffsetTransitionRule, tck.java.time.zone.TCKZoneRulesProvider, tck.java.time.zone.TCKZoneRules, tck.java.time.zone.serial.TCKFixedZoneRulesSerialization, tck.java.time.zone.serial.TCKZoneOffsetTransitionRuleSerialization, tck.java.time.zone.serial.TCKZoneOffsetTransitionSerialization, tck.java.time.zone.serial.TCKZoneRulesSerialization, tck.java.time.zone.TCKFixedZoneRules, tck.java.time.zone.TCKZoneOffsetTransition, tck.java.time.AbstractTCKTest, tck.java.time.TCKMonthDay, tck.java.time.TCKClock_System, test.java.util.TestFormatter, test.java.time.format.TestZoneTextPrinterParser, test.java.time.format.TestNarrowMonthNamesAndDayNames, test.java.time.format.TestTextParser, test.java.time.format.MockIOExceptionAppendable, test.java.time.format.TestStringLiteralPrinter, test.java.time.format.AbstractTestPrinterParser, test.java.time.format.TestNonIsoFormatter, test.java.time.format.TestNumberParser, test.java.time.format.TestZoneOffsetPrinter, test.java.time.format.TestCharLiteralPrinter, test.java.time.format.TestSettingsParser, test.java.time.format.TestDateTimeTextProvider, test.java.time.format.TestNumberPrinter, test.java.time.format.ZoneName, test.java.time.format.TestReducedParser, test.java.time.format.TestCharLiteralParser, test.java.time.format.TestFractionPrinterParser, test.java.time.format.TestStringLiteralParser, test.java.time.format.TestPadPrinterDecorator, test.java.time.format.TestReducedPrinter, test.java.time.format.TestTextPrinter, test.java.time.format.TestDateTimeFormatterBuilder, test.java.time.format.TestDateTimeParsing, test.java.time.format.TestDateTimeFormatter, test.java.time.format.TestDecimalStyle, test.java.time.format.TestZoneOffsetParser, test.java.time.TestMonthDay, test.java.time.TestZonedDateTime, test.java.time.TestLocalTime, test.java.time.temporal.MockFieldValue, test.java.time.temporal.TestDateTimeBuilderCombinations, test.java.time.temporal.TestDateTimeValueRange, test.java.time.temporal.TestChronoField, test.java.time.temporal.TestChronoUnit, test.java.time.temporal.MockFieldNoValue, test.java.time.temporal.TestJulianFields, test.java.time.temporal.TestIsoWeekFields, test.java.time.TestYearMonth, test.java.time.TestYear, test.java.time.TestLocalDateTime, test.java.time.TestClock_Fixed, test.java.time.TestPeriod, test.java.time.TestLocalDate, test.java.time.TestZoneOffset, test.java.time.AbstractTest, test.java.time.MockSimplePeriod, test.java.time.chrono.TestIsoChronoImpl, test.java.time.chrono.TestChronoLocalDate, test.java.time.chrono.TestUmmAlQuraChronology, test.java.time.chrono.TestJapaneseChronology, test.java.time.chrono.TestServiceLoader, test.java.time.chrono.TestJapaneseChronoImpl, test.java.time.chrono.TestChronologyPerf, test.java.time.chrono.TestThaiBuddhistChronoImpl, test.java.time.chrono.TestExampleCode, test.java.time.TestDuration, test.java.time.TestZoneId, test.java.time.TestOffsetDateTime_instants, test.java.time.TestOffsetTime, test.java.time.zone.TestFixedZoneRules, test.java.time.TestClock_Offset, test.java.time.TestOffsetDateTime, test.java.time.TestClock_Tick, test.java.time.TestClock_System, test.java.time.TestInstant
elapsed time (seconds): 30.265
result: Passed. Build successful
#section:compile
----------messages:(5/293)----------
command: compile -implicit:none /var/www/hudson/ws/workspace/MinimalDepsRun/jake/jdk/test/lib/testlibrary/jdk/testlibrary/RandomFactory.java
reason: .class file out of date or does not exist
Additional options from @modules: --add-modules java.base
Mode: othervm
elapsed time (seconds): 3.276
----------configuration:(6/336)----------
javac compilation environment
add modules: java.base
limit modules: java.base
class path: /var/www/hudson/ws/workspace/MinimalDepsRun/jake/jdk/test/JTwork-java-time-tck-java-time-format-TCKDateTimeParseResolver-java_0/classes/lib/testlibrary
/var/www/hudson/ws/workspace/MinimalDepsRun/jtreg/lib/testng.jar
----------rerun:(18/1740)*----------
HOME=/var/lib/hudson \\
JTREG_HOME=/var/www/hudson/ws/workspace/MinimalDepsRun/jtreg \\
LANG=en_US.UTF-8 \\
PATH=/bin:/usr/bin \\
/var/www/hudson/ws/workspace/MinimalDepsRun/jake/build/linux-x64/images/jdk/bin/javac \\
-J-Dtest.src=/var/www/hudson/ws/workspace/MinimalDepsRun/jake/jdk/test/java/time \\
-J-Dtest.src.path=/var/www/hudson/ws/workspace/MinimalDepsRun/jake/jdk/test/java/time:/var/www/hudson/ws/workspace/MinimalDepsRun/jake/jdk/test/lib/testlibrary \\
-J-Dtest.classes=/var/www/hudson/ws/workspace/MinimalDepsRun/jake/jdk/test/JTwork-java-time-tck-java-time-format-TCKDateTimeParseResolver-java_0/classes/java/time \\
-J-Dtest.class.path=/var/www/hudson/ws/workspace/MinimalDepsRun/jake/jdk/test/JTwork-java-time-tck-java-time-format-TCKDateTimeParseResolver-java_0/classes/java/time:/var/www/hudson/ws/workspace/MinimalDepsRun/jake/jdk/test/JTwork-java-time-tck-java-time-format-TCKDateTimeParseResolver-java_0/classes/lib/testlibrary \\
-J-Dtest.vm.opts= \\
-J-Dtest.tool.vm.opts= \\
-J-Dtest.compiler.opts='--limit-modules java.base' \\
-J-Dtest.java.opts='--limit-modules java.base' \\
-J-Dtest.jdk=/var/www/hudson/ws/workspace/MinimalDepsRun/jake/build/linux-x64/images/jdk \\
-J-Dcompile.jdk=/var/www/hudson/ws/workspace/MinimalDepsRun/jake/build/linux-x64/images/jdk \\
-J-Dtest.timeout.factor=1.0 \\
-J-Dtest.modules='java.base/java.time:open java.base/java.time.chrono:open java.base/java.time.zone:open' \\
@/var/www/hudson/ws/workspace/MinimalDepsRun/jake/jdk/test/JTwork-java-time-tck-java-time-format-TCKDateTimeParseResolver-java_0/java/time/tck/java/time/format/TCKDateTimeParseResolver.d/compile.0.jta
----------System.out:(0/0)----------
----------System.err:(0/0)----------
result: Passed. Compilation successful
#section:compile
----------messages:(5/19514)----------
command: compile -implicit:none /var/www/hudson/ws/workspace/MinimalDepsRun/jake/jdk/test/java/time/tck/java/time/AbstractDateTimeTest.java /var/www/hudson/ws/workspace/MinimalDepsRun/jake/jdk/test/java/time/tck/java/time/TCKZonedDateTime.java /var/www/hudson/ws/workspace/MinimalDepsRun/jake/jdk/test/java/time/tck/java/time/TCKZoneId.java /var/www/hudson/ws/workspace/MinimalDepsRun/jake/jdk/test/java/time/tck/java/time/TCKYear.java /var/www/hudson/ws/workspace/MinimalDepsRun/jake/jdk/test/java/time/tck/java/time/format/TCKDateTimeFormatter.java /var/www/hudson/ws/workspace/MinimalDepsRun/jake/jdk/test/java/time/tck/java/time/format/TCKLocalizedFieldParser.java /var/www/hudson/ws/workspace/MinimalDepsRun/jake/jdk/test/java/time/tck/java/time/format/TCKChronoPrinterParser.java /var/www/hudson/ws/workspace/MinimalDepsRun/jake/jdk/test/java/time/tck/java/time/format/TCKPadPrinterParser.java /var/www/hudson/ws/workspace/MinimalDepsRun/jake/jdk/test/java/time/tck/java/time/format/TCKInstantPrinterParser.java /var/www/hudson/ws/workspace/MinimalDepsRun/jake/jdk/test/java/time/tck/java/time/format/TCKDecimalStyle.java /var/www/hudson/ws/workspace/MinimalDepsRun/jake/jdk/test/java/time/tck/java/time/format/TCKDateTimeFormatters.java /var/www/hudson/ws/workspace/MinimalDepsRun/jake/jdk/test/java/time/tck/java/time/format/TCKDateTimeParseResolver.java /var/www/hudson/ws/workspace/MinimalDepsRun/jake/jdk/test/java/time/tck/java/time/format/TCKDateTimeTextPrinting.java /var/www/hudson/ws/workspace/MinimalDepsRun/jake/jdk/test/java/time/tck/java/time/format/TCKZoneIdPrinterParser.java /var/www/hudson/ws/workspace/MinimalDepsRun/jake/jdk/test/java/time/tck/java/time/format/TCKOffsetPrinterParser.java /var/www/hudson/ws/workspace/MinimalDepsRun/jake/jdk/test/java/time/tck/java/time/format/TCKLocalizedPrinterParser.java /var/www/hudson/ws/workspace/MinimalDepsRun/jake/jdk/test/java/time/tck/java/time/format/TCKLocalizedOffsetIdPrinterParser.java /var/www/hudson/ws/workspace/MinimalDepsRun/jake/jdk/test/java/time/tck/java/time/format/TCKDTFParsedInstant.java /var/www/hudson/ws/workspace/MinimalDepsRun/jake/jdk/test/java/time/tck/java/time/format/TCKSignStyle.java /var/www/hudson/ws/workspace/MinimalDepsRun/jake/jdk/test/java/time/tck/java/time/format/TCKFormatStyle.java /var/www/hudson/ws/workspace/MinimalDepsRun/jake/jdk/test/java/time/tck/java/time/format/TCKResolverStyle.java /var/www/hudson/ws/workspace/MinimalDepsRun/jake/jdk/test/java/time/tck/java/time/format/TCKLocalizedFieldPrinter.java /var/www/hudson/ws/workspace/MinimalDepsRun/jake/jdk/test/java/time/tck/java/time/format/TCKTextStyle.java /var/www/hudson/ws/workspace/MinimalDepsRun/jake/jdk/test/java/time/tck/java/time/format/TCKDateTimeFormatterBuilder.java /var/www/hudson/ws/workspace/MinimalDepsRun/jake/jdk/test/java/time/tck/java/time/TestIsoChronology.java /var/www/hudson/ws/workspace/MinimalDepsRun/jake/jdk/test/java/time/tck/java/time/TCKMonth.java /var/www/hudson/ws/workspace/MinimalDepsRun/jake/jdk/test/java/time/tck/java/time/TCKLocalDateTime.java /var/www/hudson/ws/workspace/MinimalDepsRun/jake/jdk/test/java/time/tck/java/time/temporal/TCKTemporalAdjusters.java /var/www/hudson/ws/workspace/MinimalDepsRun/jake/jdk/test/java/time/tck/java/time/temporal/TCKJulianFields.java /var/www/hudson/ws/workspace/MinimalDepsRun/jake/jdk/test/java/time/tck/java/time/temporal/TCKIsoFields.java /var/www/hudson/ws/workspace/MinimalDepsRun/jake/jdk/test/java/time/tck/java/time/temporal/serial/TCKJulianFieldsSerialization.java /var/www/hudson/ws/workspace/MinimalDepsRun/jake/jdk/test/java/time/tck/java/time/temporal/serial/TCKValueRangeSerialization.java /var/www/hudson/ws/workspace/MinimalDepsRun/jake/jdk/test/java/time/tck/java/time/temporal/serial/TCKWeekFieldsSerialization.java /var/www/hudson/ws/workspace/MinimalDepsRun/jake/jdk/test/java/time/tck/java/time/temporal/serial/TCKChronoFieldSerialization.java /var/www/hudson/ws/workspace/MinimalDepsRun/jake/jdk/test/java/time/tck/java/time/temporal/serial/TCKChronoUnitSerialization.java /var/www/hudson/ws/workspace/MinimalDepsRun/jake/jdk/test/java/time/tck/java/time/temporal/TCKChronoField.java /var/www/hudson/ws/workspace/MinimalDepsRun/jake/jdk/test/java/time/tck/java/time/temporal/TCKChronoUnit.java /var/www/hudson/ws/workspace/MinimalDepsRun/jake/jdk/test/java/time/tck/java/time/temporal/TCKWeekFields.java /var/www/hudson/ws/workspace/MinimalDepsRun/jake/jdk/test/java/time/tck/java/time/TCKClock_Tick.java /var/www/hudson/ws/workspace/MinimalDepsRun/jake/jdk/test/java/time/tck/java/time/TCKClock_Fixed.java /var/www/hudson/ws/workspace/MinimalDepsRun/jake/jdk/test/java/time/tck/java/time/serial/TCKZoneOffsetSerialization.java /var/www/hudson/ws/workspace/MinimalDepsRun/jake/jdk/test/java/time/tck/java/time/serial/TCKDurationSerialization.java /var/www/hudson/ws/workspace/MinimalDepsRun/jake/jdk/test/java/time/tck/java/time/serial/TCKZoneIdSerialization.java /var/www/hudson/ws/workspace/MinimalDepsRun/jake/jdk/test/java/time/tck/java/time/serial/TCKLocalDateSerialization.java /var/www/hudson/ws/workspace/MinimalDepsRun/jake/jdk/test/java/time/tck/java/time/serial/TCKLocalDateTimeSerialization.java /var/www/hudson/ws/workspace/MinimalDepsRun/jake/jdk/test/java/time/tck/java/time/serial/TCKClockSerialization.java /var/www/hudson/ws/workspace/MinimalDepsRun/jake/jdk/test/java/time/tck/java/time/serial/TCKOffsetTimeSerialization.java /var/www/hudson/ws/workspace/MinimalDepsRun/jake/jdk/test/java/time/tck/java/time/serial/TCKZonedDateTimeSerialization.java /var/www/hudson/ws/workspace/MinimalDepsRun/jake/jdk/test/java/time/tck/java/time/serial/TCKYearMonthSerialization.java /var/www/hudson/ws/workspace/MinimalDepsRun/jake/jdk/test/java/time/tck/java/time/serial/TCKOffsetDateTimeSerialization.java /var/www/hudson/ws/workspace/MinimalDepsRun/jake/jdk/test/java/time/tck/java/time/serial/TCKInstantSerialization.java /var/www/hudson/ws/workspace/MinimalDepsRun/jake/jdk/test/java/time/tck/java/time/serial/TCKLocalTimeSerialization.java /var/www/hudson/ws/workspace/MinimalDepsRun/jake/jdk/test/java/time/tck/java/time/serial/TCKMonthDaySerialization.java /var/www/hudson/ws/workspace/MinimalDepsRun/jake/jdk/test/java/time/tck/java/time/serial/TCKYearSerialization.java /var/www/hudson/ws/workspace/MinimalDepsRun/jake/jdk/test/java/time/tck/java/time/serial/TCKPeriodSerialization.java /var/www/hudson/ws/workspace/MinimalDepsRun/jake/jdk/test/java/time/tck/java/time/TCKYearMonth.java /var/www/hudson/ws/workspace/MinimalDepsRun/jake/jdk/test/java/time/tck/java/time/TCKOffsetDateTime.java /var/www/hudson/ws/workspace/MinimalDepsRun/jake/jdk/test/java/time/tck/java/time/TCKClock.java /var/www/hudson/ws/workspace/MinimalDepsRun/jake/jdk/test/java/time/tck/java/time/TCKDayOfWeek.java /var/www/hudson/ws/workspace/MinimalDepsRun/jake/jdk/test/java/time/tck/java/time/MockSimplePeriod.java /var/www/hudson/ws/workspace/MinimalDepsRun/jake/jdk/test/java/time/tck/java/time/TCKPeriod.java /var/www/hudson/ws/workspace/MinimalDepsRun/jake/jdk/test/java/time/tck/java/time/TCKOffsetTime.java /var/www/hudson/ws/workspace/MinimalDepsRun/jake/jdk/test/java/time/tck/java/time/TCKDuration.java /var/www/hudson/ws/workspace/MinimalDepsRun/jake/jdk/test/java/time/tck/java/time/chrono/TCKHijrahEra.java /var/www/hudson/ws/workspace/MinimalDepsRun/jake/jdk/test/java/time/tck/java/time/chrono/CopticEra.java /var/www/hudson/ws/workspace/MinimalDepsRun/jake/jdk/test/java/time/tck/java/time/chrono/TCKTestServiceLoader.java /var/www/hudson/ws/workspace/MinimalDepsRun/jake/jdk/test/java/time/tck/java/time/chrono/CopticDate.java /var/www/hudson/ws/workspace/MinimalDepsRun/jake/jdk/test/java/time/tck/java/time/chrono/TCKJapaneseChronology.java /var/www/hudson/ws/workspace/MinimalDepsRun/jake/jdk/test/java/time/tck/java/time/chrono/TCKChronoPeriod.java /var/www/hudson/ws/workspace/MinimalDepsRun/jake/jdk/test/java/time/tck/java/time/chrono/TCKThaiBuddhistChronology.java /var/www/hudson/ws/workspace/MinimalDepsRun/jake/jdk/test/java/time/tck/java/time/chrono/TCKIsoChronology.java /var/www/hudson/ws/workspace/MinimalDepsRun/jake/jdk/test/java/time/tck/java/time/chrono/serial/TCKChronoZonedDateTimeSerialization.java /var/www/hudson/ws/workspace/MinimalDepsRun/jake/jdk/test/java/time/tck/java/time/chrono/serial/TCKChronoLocalDateTimeSerialization.java /var/www/hudson/ws/workspace/MinimalDepsRun/jake/jdk/test/java/time/tck/java/time/chrono/serial/TCKEraSerialization.java /var/www/hudson/ws/workspace/MinimalDepsRun/jake/jdk/test/java/time/tck/java/time/chrono/serial/TCKChronologySerialization.java /var/www/hudson/ws/workspace/MinimalDepsRun/jake/jdk/test/java/time/tck/java/time/chrono/serial/TCKCopticSerialization.java /var/www/hudson/ws/workspace/MinimalDepsRun/jake/jdk/test/java/time/tck/java/time/chrono/serial/TCKChronoLocalDateSerialization.java /var/www/hudson/ws/workspace/MinimalDepsRun/jake/jdk/test/java/time/tck/java/time/chrono/TCKThaiBuddhistEra.java /var/www/hudson/ws/workspace/MinimalDepsRun/jake/jdk/test/java/time/tck/java/time/chrono/CopticChronology.java /var/www/hudson/ws/workspace/MinimalDepsRun/jake/jdk/test/java/time/tck/java/time/chrono/TCKChronology.java /var/www/hudson/ws/workspace/MinimalDepsRun/jake/jdk/test/java/time/tck/java/time/chrono/TCKChronoLocalDate.java /var/www/hudson/ws/workspace/MinimalDepsRun/jake/jdk/test/java/time/tck/java/time/chrono/TCKChronoZonedDateTime.java /var/www/hudson/ws/workspace/MinimalDepsRun/jake/jdk/test/java/time/tck/java/time/chrono/TCKMinguoEra.java /var/www/hudson/ws/workspace/MinimalDepsRun/jake/jdk/test/java/time/tck/java/time/chrono/TCKIsoEra.java /var/www/hudson/ws/workspace/MinimalDepsRun/jake/jdk/test/java/time/tck/java/time/chrono/TCKMinguoChronology.java /var/www/hudson/ws/workspace/MinimalDepsRun/jake/jdk/test/java/time/tck/java/time/chrono/TCKChronoLocalDateTime.java /var/www/hudson/ws/workspace/MinimalDepsRun/jake/jdk/test/java/time/tck/java/time/chrono/TCKJapaneseEra.java /var/www/hudson/ws/workspace/MinimalDepsRun/jake/jdk/test/java/time/tck/java/time/chrono/TCKHijrahChronology.java /var/www/hudson/ws/workspace/MinimalDepsRun/jake/jdk/test/java/time/tck/java/time/TCKLocalDate.java /var/www/hudson/ws/workspace/MinimalDepsRun/jake/jdk/test/java/time/tck/java/time/TCKLocalTime.java /var/www/hudson/ws/workspace/MinimalDepsRun/jake/jdk/test/java/time/tck/java/time/TCKClock_Offset.java /var/www/hudson/ws/workspace/MinimalDepsRun/jake/jdk/test/java/time/tck/java/time/TCKInstant.java /var/www/hudson/ws/workspace/MinimalDepsRun/jake/jdk/test/java/time/tck/java/time/TCKZoneOffset.java /var/www/hudson/ws/workspace/MinimalDepsRun/jake/jdk/test/java/time/tck/java/time/zone/TCKZoneOffsetTransitionRule.java /var/www/hudson/ws/workspace/MinimalDepsRun/jake/jdk/test/java/time/tck/java/time/zone/TCKZoneRulesProvider.java /var/www/hudson/ws/workspace/MinimalDepsRun/jake/jdk/test/java/time/tck/java/time/zone/TCKZoneRules.java /var/www/hudson/ws/workspace/MinimalDepsRun/jake/jdk/test/java/time/tck/java/time/zone/serial/TCKFixedZoneRulesSerialization.java /var/www/hudson/ws/workspace/MinimalDepsRun/jake/jdk/test/java/time/tck/java/time/zone/serial/TCKZoneOffsetTransitionRuleSerialization.java /var/www/hudson/ws/workspace/MinimalDepsRun/jake/jdk/test/java/time/tck/java/time/zone/serial/TCKZoneOffsetTransitionSerialization.java /var/www/hudson/ws/workspace/MinimalDepsRun/jake/jdk/test/java/time/tck/java/time/zone/serial/TCKZoneRulesSerialization.java /var/www/hudson/ws/workspace/MinimalDepsRun/jake/jdk/test/java/time/tck/java/time/zone/TCKFixedZoneRules.java /var/www/hudson/ws/workspace/MinimalDepsRun/jake/jdk/test/java/time/tck/java/time/zone/TCKZoneOffsetTransition.java /var/www/hudson/ws/workspace/MinimalDepsRun/jake/jdk/test/java/time/tck/java/time/AbstractTCKTest.java /var/www/hudson/ws/workspace/MinimalDepsRun/jake/jdk/test/java/time/tck/java/time/TCKMonthDay.java /var/www/hudson/ws/workspace/MinimalDepsRun/jake/jdk/test/java/time/tck/java/time/TCKClock_System.java /var/www/hudson/ws/workspace/MinimalDepsRun/jake/jdk/test/java/time/test/java/util/TestFormatter.java /var/www/hudson/ws/workspace/MinimalDepsRun/jake/jdk/test/java/time/test/java/time/format/TestZoneTextPrinterParser.java /var/www/hudson/ws/workspace/MinimalDepsRun/jake/jdk/test/java/time/test/java/time/format/TestNarrowMonthNamesAndDayNames.java /var/www/hudson/ws/workspace/MinimalDepsRun/jake/jdk/test/java/time/test/java/time/format/TestTextParser.java /var/www/hudson/ws/workspace/MinimalDepsRun/jake/jdk/test/java/time/test/java/time/format/MockIOExceptionAppendable.java /var/www/hudson/ws/workspace/MinimalDepsRun/jake/jdk/test/java/time/test/java/time/format/TestStringLiteralPrinter.java /var/www/hudson/ws/workspace/MinimalDepsRun/jake/jdk/test/java/time/test/java/time/format/AbstractTestPrinterParser.java /var/www/hudson/ws/workspace/MinimalDepsRun/jake/jdk/test/java/time/test/java/time/format/TestNonIsoFormatter.java /var/www/hudson/ws/workspace/MinimalDepsRun/jake/jdk/test/java/time/test/java/time/format/TestNumberParser.java /var/www/hudson/ws/workspace/MinimalDepsRun/jake/jdk/test/java/time/test/java/time/format/TestZoneOffsetPrinter.java /var/www/hudson/ws/workspace/MinimalDepsRun/jake/jdk/test/java/time/test/java/time/format/TestCharLiteralPrinter.java /var/www/hudson/ws/workspace/MinimalDepsRun/jake/jdk/test/java/time/test/java/time/format/TestSettingsParser.java /var/www/hudson/ws/workspace/MinimalDepsRun/jake/jdk/test/java/time/test/java/time/format/TestDateTimeTextProvider.java /var/www/hudson/ws/workspace/MinimalDepsRun/jake/jdk/test/java/time/test/java/time/format/TestNumberPrinter.java /var/www/hudson/ws/workspace/MinimalDepsRun/jake/jdk/test/java/time/test/java/time/format/ZoneName.java /var/www/hudson/ws/workspace/MinimalDepsRun/jake/jdk/test/java/time/test/java/time/format/TestReducedParser.java /var/www/hudson/ws/workspace/MinimalDepsRun/jake/jdk/test/java/time/test/java/time/format/TestCharLiteralParser.java /var/www/hudson/ws/workspace/MinimalDepsRun/jake/jdk/test/java/time/test/java/time/format/TestFractionPrinterParser.java /var/www/hudson/ws/workspace/MinimalDepsRun/jake/jdk/test/java/time/test/java/time/format/TestStringLiteralParser.java /var/www/hudson/ws/workspace/MinimalDepsRun/jake/jdk/test/java/time/test/java/time/format/TestPadPrinterDecorator.java /var/www/hudson/ws/workspace/MinimalDepsRun/jake/jdk/test/java/time/test/java/time/format/TestReducedPrinter.java /var/www/hudson/ws/workspace/MinimalDepsRun/jake/jdk/test/java/time/test/java/time/format/TestTextPrinter.java /var/www/hudson/ws/workspace/MinimalDepsRun/jake/jdk/test/java/time/test/java/time/format/TestDateTimeFormatterBuilder.java /var/www/hudson/ws/workspace/MinimalDepsRun/jake/jdk/test/java/time/test/java/time/format/TestDateTimeParsing.java /var/www/hudson/ws/workspace/MinimalDepsRun/jake/jdk/test/java/time/test/java/time/format/TestDateTimeFormatter.java /var/www/hudson/ws/workspace/MinimalDepsRun/jake/jdk/test/java/time/test/java/time/format/TestDecimalStyle.java /var/www/hudson/ws/workspace/MinimalDepsRun/jake/jdk/test/java/time/test/java/time/format/TestZoneOffsetParser.java /var/www/hudson/ws/workspace/MinimalDepsRun/jake/jdk/test/java/time/test/java/time/TestMonthDay.java /var/www/hudson/ws/workspace/MinimalDepsRun/jake/jdk/test/java/time/test/java/time/TestZonedDateTime.java /var/www/hudson/ws/workspace/MinimalDepsRun/jake/jdk/test/java/time/test/java/time/TestLocalTime.java /var/www/hudson/ws/workspace/MinimalDepsRun/jake/jdk/test/java/time/test/java/time/temporal/MockFieldValue.java /var/www/hudson/ws/workspace/MinimalDepsRun/jake/jdk/test/java/time/test/java/time/temporal/TestDateTimeBuilderCombinations.java /var/www/hudson/ws/workspace/MinimalDepsRun/jake/jdk/test/java/time/test/java/time/temporal/TestDateTimeValueRange.java /var/www/hudson/ws/workspace/MinimalDepsRun/jake/jdk/test/java/time/test/java/time/temporal/TestChronoField.java /var/www/hudson/ws/workspace/MinimalDepsRun/jake/jdk/test/java/time/test/java/time/temporal/TestChronoUnit.java /var/www/hudson/ws/workspace/MinimalDepsRun/jake/jdk/test/java/time/test/java/time/temporal/MockFieldNoValue.java /var/www/hudson/ws/workspace/MinimalDepsRun/jake/jdk/test/java/time/test/java/time/temporal/TestJulianFields.java /var/www/hudson/ws/workspace/MinimalDepsRun/jake/jdk/test/java/time/test/java/time/temporal/TestIsoWeekFields.java /var/www/hudson/ws/workspace/MinimalDepsRun/jake/jdk/test/java/time/test/java/time/TestYearMonth.java /var/www/hudson/ws/workspace/MinimalDepsRun/jake/jdk/test/java/time/test/java/time/TestYear.java /var/www/hudson/ws/workspace/MinimalDepsRun/jake/jdk/test/java/time/test/java/time/TestLocalDateTime.java /var/www/hudson/ws/workspace/MinimalDepsRun/jake/jdk/test/java/time/test/java/time/TestClock_Fixed.java /var/www/hudson/ws/workspace/MinimalDepsRun/jake/jdk/test/java/time/test/java/time/TestPeriod.java /var/www/hudson/ws/workspace/MinimalDepsRun/jake/jdk/test/java/time/test/java/time/TestLocalDate.java /var/www/hudson/ws/workspace/MinimalDepsRun/jake/jdk/test/java/time/test/java/time/TestZoneOffset.java /var/www/hudson/ws/workspace/MinimalDepsRun/jake/jdk/test/java/time/test/java/time/AbstractTest.java /var/www/hudson/ws/workspace/MinimalDepsRun/jake/jdk/test/java/time/test/java/time/MockSimplePeriod.java /var/www/hudson/ws/workspace/MinimalDepsRun/jake/jdk/test/java/time/test/java/time/chrono/TestIsoChronoImpl.java /var/www/hudson/ws/workspace/MinimalDepsRun/jake/jdk/test/java/time/test/java/time/chrono/TestChronoLocalDate.java /var/www/hudson/ws/workspace/MinimalDepsRun/jake/jdk/test/java/time/test/java/time/chrono/TestUmmAlQuraChronology.java /var/www/hudson/ws/workspace/MinimalDepsRun/jake/jdk/test/java/time/test/java/time/chrono/TestJapaneseChronology.java /var/www/hudson/ws/workspace/MinimalDepsRun/jake/jdk/test/java/time/test/java/time/chrono/TestServiceLoader.java /var/www/hudson/ws/workspace/MinimalDepsRun/jake/jdk/test/java/time/test/java/time/chrono/TestJapaneseChronoImpl.java /var/www/hudson/ws/workspace/MinimalDepsRun/jake/jdk/test/java/time/test/java/time/chrono/TestChronologyPerf.java /var/www/hudson/ws/workspace/MinimalDepsRun/jake/jdk/test/java/time/test/java/time/chrono/TestThaiBuddhistChronoImpl.java /var/www/hudson/ws/workspace/MinimalDepsRun/jake/jdk/test/java/time/test/java/time/chrono/TestExampleCode.java /var/www/hudson/ws/workspace/MinimalDepsRun/jake/jdk/test/java/time/test/java/time/TestDuration.java /var/www/hudson/ws/workspace/MinimalDepsRun/jake/jdk/test/java/time/test/java/time/TestZoneId.java /var/www/hudson/ws/workspace/MinimalDepsRun/jake/jdk/test/java/time/test/java/time/TestOffsetDateTime_instants.java /var/www/hudson/ws/workspace/MinimalDepsRun/jake/jdk/test/java/time/test/java/time/TestOffsetTime.java /var/www/hudson/ws/workspace/MinimalDepsRun/jake/jdk/test/java/time/test/java/time/zone/TestFixedZoneRules.java /var/www/hudson/ws/workspace/MinimalDepsRun/jake/jdk/test/java/time/test/java/time/TestClock_Offset.java /var/www/hudson/ws/workspace/MinimalDepsRun/jake/jdk/test/java/time/test/java/time/TestOffsetDateTime.java /var/www/hudson/ws/workspace/MinimalDepsRun/jake/jdk/test/java/time/test/java/time/TestClock_Tick.java /var/www/hudson/ws/workspace/MinimalDepsRun/jake/jdk/test/java/time/test/java/time/TestClock_System.java /var/www/hudson/ws/workspace/MinimalDepsRun/jake/jdk/test/java/time/test/java/time/TestInstant.java
reason: .class file out of date or does not exist
Additional options from @modules: --add-modules java.base
Mode: othervm
elapsed time (seconds): 26.942
----------configuration:(8/584)----------
javac compilation environment
add modules: java.base
limit modules: java.base
class path: /var/www/hudson/ws/workspace/MinimalDepsRun/jake/jdk/test/java/time
/var/www/hudson/ws/workspace/MinimalDepsRun/jake/jdk/test/JTwork-java-time-tck-java-time-format-TCKDateTimeParseResolver-java_0/classes/java/time
/var/www/hudson/ws/workspace/MinimalDepsRun/jake/jdk/test/JTwork-java-time-tck-java-time-format-TCKDateTimeParseResolver-java_0/classes/lib/testlibrary
/var/www/hudson/ws/workspace/MinimalDepsRun/jtreg/lib/testng.jar
----------rerun:(18/1740)*----------
HOME=/var/lib/hudson \\
JTREG_HOME=/var/www/hudson/ws/workspace/MinimalDepsRun/jtreg \\
LANG=en_US.UTF-8 \\
PATH=/bin:/usr/bin \\
/var/www/hudson/ws/workspace/MinimalDepsRun/jake/build/linux-x64/images/jdk/bin/javac \\
-J-Dtest.src=/var/www/hudson/ws/workspace/MinimalDepsRun/jake/jdk/test/java/time \\
-J-Dtest.src.path=/var/www/hudson/ws/workspace/MinimalDepsRun/jake/jdk/test/java/time:/var/www/hudson/ws/workspace/MinimalDepsRun/jake/jdk/test/lib/testlibrary \\
-J-Dtest.classes=/var/www/hudson/ws/workspace/MinimalDepsRun/jake/jdk/test/JTwork-java-time-tck-java-time-format-TCKDateTimeParseResolver-java_0/classes/java/time \\
-J-Dtest.class.path=/var/www/hudson/ws/workspace/MinimalDepsRun/jake/jdk/test/JTwork-java-time-tck-java-time-format-TCKDateTimeParseResolver-java_0/classes/java/time:/var/www/hudson/ws/workspace/MinimalDepsRun/jake/jdk/test/JTwork-java-time-tck-java-time-format-TCKDateTimeParseResolver-java_0/classes/lib/testlibrary \\
-J-Dtest.vm.opts= \\
-J-Dtest.tool.vm.opts= \\
-J-Dtest.compiler.opts='--limit-modules java.base' \\
-J-Dtest.java.opts='--limit-modules java.base' \\
-J-Dtest.jdk=/var/www/hudson/ws/workspace/MinimalDepsRun/jake/build/linux-x64/images/jdk \\
-J-Dcompile.jdk=/var/www/hudson/ws/workspace/MinimalDepsRun/jake/build/linux-x64/images/jdk \\
-J-Dtest.timeout.factor=1.0 \\
-J-Dtest.modules='java.base/java.time:open java.base/java.time.chrono:open java.base/java.time.zone:open' \\
@/var/www/hudson/ws/workspace/MinimalDepsRun/jake/jdk/test/JTwork-java-time-tck-java-time-format-TCKDateTimeParseResolver-java_0/java/time/tck/java/time/format/TCKDateTimeParseResolver.d/compile.1.jta
----------System.out:(0/0)----------
----------System.err:(0/0)----------
result: Passed. Compilation successful
#section:testng
----------messages:(5/409)----------
command: testng tck.java.time.format.TCKDateTimeParseResolver
reason: Assumed action based on file name: run testng tck.java.time.format.TCKDateTimeParseResolver
Mode: othervm
Additional options from @modules: --add-modules java.base --add-opens java.base/java.time=ALL-UNNAMED --add-opens java.base/java.time.chrono=ALL-UNNAMED --add-opens java.base/java.time.zone=ALL-UNNAMED
elapsed time (seconds): 2.305
----------configuration:(7/270)----------
Boot Layer
add modules: java.base
limit modules: java.base
add opens: java.base/java.time ALL-UNNAMED
java.base/java.time.chrono ALL-UNNAMED
java.base/java.time.zone ALL-UNNAMED
----------System.out:(608/49821)----------
[TestNG] Running:
java/time/tck/java/time/format/TCKDateTimeParseResolver.java
test tck.java.time.format.TCKDateTimeParseResolver.test_fieldResolvesToChronoLocalDateTime_noOverrideChrono_matches(): success
test tck.java.time.format.TCKDateTimeParseResolver.test_fieldResolvesToChronoLocalDateTime_noOverrideChrono_wrongChrono(): success
test tck.java.time.format.TCKDateTimeParseResolver.test_fieldResolvesToChronoLocalDateTime_overrideChrono_matches(): success
test tck.java.time.format.TCKDateTimeParseResolver.test_fieldResolvesToChronoLocalDateTime_overrideChrono_wrongChrono(): success
test tck.java.time.format.TCKDateTimeParseResolver.test_fieldResolvesToChronoLocalDate_noOverrideChrono_matches(): success
test tck.java.time.format.TCKDateTimeParseResolver.test_fieldResolvesToChronoLocalDate_noOverrideChrono_wrongChrono(): success
test tck.java.time.format.TCKDateTimeParseResolver.test_fieldResolvesToChronoLocalDate_overrideChrono_matches(): success
test tck.java.time.format.TCKDateTimeParseResolver.test_fieldResolvesToChronoLocalDate_overrideChrono_wrongChrono(): success
test tck.java.time.format.TCKDateTimeParseResolver.test_fieldResolvesToChronoZonedDateTime_noOverrideChrono_matches(): success
test tck.java.time.format.TCKDateTimeParseResolver.test_fieldResolvesToChronoZonedDateTime_noOverrideChrono_wrongChrono(): success
test tck.java.time.format.TCKDateTimeParseResolver.test_fieldResolvesToChronoZonedDateTime_overrideChrono_matches(): success
test tck.java.time.format.TCKDateTimeParseResolver.test_fieldResolvesToChronoZonedDateTime_overrideChrono_wrongChrono(): success
test tck.java.time.format.TCKDateTimeParseResolver.test_fieldResolvesToChronoZonedDateTime_overrideZone_matches(): success
test tck.java.time.format.TCKDateTimeParseResolver.test_fieldResolvesToChronoZonedDateTime_overrideZone_wrongZone(): success
test tck.java.time.format.TCKDateTimeParseResolver.test_fieldResolvesToLocalTime(): success
test tck.java.time.format.TCKDateTimeParseResolver.test_parse_fromField_InstantSeconds(): success
test tck.java.time.format.TCKDateTimeParseResolver.test_parse_fromField_InstantSeconds_NanoOfSecond(): success
test tck.java.time.format.TCKDateTimeParseResolver.test_parse_fromField_SecondOfDay(): success
test tck.java.time.format.TCKDateTimeParseResolver.test_parse_fromField_SecondOfDay_NanoOfSecond(): success
test tck.java.time.format.TCKDateTimeParseResolver.test_parse_fromField_SecondOfMinute(): success
test tck.java.time.format.TCKDateTimeParseResolver.test_parse_fromField_SecondOfMinute_NanoOfSecond(): success
test tck.java.time.format.TCKDateTimeParseResolver.test_resolveAmPm(): failure
org.testng.internal.reflect.MethodMatcherException:
Data provider mismatch
Method: test_resolveAmPm([Parameter{index=0, type=java.time.format.ResolverStyle, declaredAnnotations=[]}, Parameter{index=1, type=long, declaredAnnotations=[]}, Parameter{index=2, type=java.lang.Integer, declaredAnnotations=[]}])
Arguments: [(java.time.format.ResolverStyle)STRICT,(java.lang.Integer)0,(java.lang.Integer)0]
at org.testng.internal.reflect.DataProviderMethodMatcher.getConformingArguments(DataProviderMethodMatcher.java:52)
at org.testng.internal.Invoker.injectParameters(Invoker.java:1228)
at org.testng.internal.Invoker.invokeTestMethods(Invoker.java:1125)
at org.testng.internal.TestMethodWorker.invokeTestMethods(TestMethodWorker.java:129)
at org.testng.internal.TestMethodWorker.run(TestMethodWorker.java:112)
at org.testng.TestRunner.privateRun(TestRunner.java:778)
at org.testng.TestRunner.run(TestRunner.java:632)
at org.testng.SuiteRunner.runTest(SuiteRunner.java:366)
at org.testng.SuiteRunner.runSequentially(SuiteRunner.java:361)
at org.testng.SuiteRunner.privateRun(SuiteRunner.java:319)
at org.testng.SuiteRunner.run(SuiteRunner.java:268)
at org.testng.SuiteRunnerWorker.runSuite(SuiteRunnerWorker.java:52)
at org.testng.SuiteRunnerWorker.run(SuiteRunnerWorker.java:86)
at org.testng.TestNG.runSuitesSequentially(TestNG.java:1222)
at org.testng.TestNG.runSuitesLocally(TestNG.java:1147)
at org.testng.TestNG.runSuites(TestNG.java:1072)
at org.testng.TestNG.run(TestNG.java:1044)
at com.sun.javatest.regtest.agent.TestNGRunner.main(TestNGRunner.java:87)
at com.sun.javatest.regtest.agent.TestNGRunner.main(TestNGRunner.java:54)
at java.base/jdk.internal.reflect.NativeMethodAccessorImpl.invoke0(Native Method)
at java.base/jdk.internal.reflect.NativeMethodAccessorImpl.invoke(NativeMethodAccessorImpl.java:62)
at java.base/jdk.internal.reflect.DelegatingMethodAccessorImpl.invoke(DelegatingMethodAccessorImpl.java:43)
at java.base/java.lang.reflect.Method.invoke(Method.java:538)
at com.sun.javatest.regtest.agent.MainWrapper$MainThread.run(MainWrapper.java:110)
at java.base/java.lang.Thread.run(Thread.java:844)
test tck.java.time.format.TCKDateTimeParseResolver.test_resolveClockHourOfAmPm(): failure
org.testng.internal.reflect.MethodMatcherException:
Data provider mismatch
Method: test_resolveClockHourOfAmPm([Parameter{index=0, type=java.time.format.ResolverStyle, declaredAnnotations=[]}, Parameter{index=1, type=long, declaredAnnotations=[]}, Parameter{index=2, type=java.lang.Integer, declaredAnnotations=[]}])
Arguments: [(java.time.format.ResolverStyle)STRICT,(java.lang.Integer)1,(java.lang.Integer)1]
at org.testng.internal.reflect.DataProviderMethodMatcher.getConformingArguments(DataProviderMethodMatcher.java:52)
at org.testng.internal.Invoker.injectParameters(Invoker.java:1228)
at org.testng.internal.Invoker.invokeTestMethods(Invoker.java:1125)
at org.testng.internal.TestMethodWorker.invokeTestMethods(TestMethodWorker.java:129)
at org.testng.internal.TestMethodWorker.run(TestMethodWorker.java:112)
at org.testng.TestRunner.privateRun(TestRunner.java:778)
at org.testng.TestRunner.run(TestRunner.java:632)
at org.testng.SuiteRunner.runTest(SuiteRunner.java:366)
at org.testng.SuiteRunner.runSequentially(SuiteRunner.java:361)
at org.testng.SuiteRunner.privateRun(SuiteRunner.java:319)
at org.testng.SuiteRunner.run(SuiteRunner.java:268)
at org.testng.SuiteRunnerWorker.runSuite(SuiteRunnerWorker.java:52)
at org.testng.SuiteRunnerWorker.run(SuiteRunnerWorker.java:86)
at org.testng.TestNG.runSuitesSequentially(TestNG.java:1222)
at org.testng.TestNG.runSuitesLocally(TestNG.java:1147)
at org.testng.TestNG.runSuites(TestNG.java:1072)
at org.testng.TestNG.run(TestNG.java:1044)
at com.sun.javatest.regtest.agent.TestNGRunner.main(TestNGRunner.java:87)
at com.sun.javatest.regtest.agent.TestNGRunner.main(TestNGRunner.java:54)
at java.base/jdk.internal.reflect.NativeMethodAccessorImpl.invoke0(Native Method)
at java.base/jdk.internal.reflect.NativeMethodAccessorImpl.invoke(NativeMethodAccessorImpl.java:62)
at java.base/jdk.internal.reflect.DelegatingMethodAccessorImpl.invoke(DelegatingMethodAccessorImpl.java:43)
at java.base/java.lang.reflect.Method.invoke(Method.java:538)
at com.sun.javatest.regtest.agent.MainWrapper$MainThread.run(MainWrapper.java:110)
at java.base/java.lang.Thread.run(Thread.java:844)
test tck.java.time.format.TCKDateTimeParseResolver.test_resolveClockHourOfDay(): failure
org.testng.internal.reflect.MethodMatcherException:
Data provider mismatch
Method: test_resolveClockHourOfDay([Parameter{index=0, type=java.time.format.ResolverStyle, declaredAnnotations=[]}, Parameter{index=1, type=long, declaredAnnotations=[]}, Parameter{index=2, type=java.lang.Integer, declaredAnnotations=[]}, Parameter{index=3, type=int, declaredAnnotations=[]}])
Arguments: [(java.time.format.ResolverStyle)STRICT,(java.lang.Integer)1,(java.lang.Integer)1,(java.lang.Integer)0]
at org.testng.internal.reflect.DataProviderMethodMatcher.getConformingArguments(DataProviderMethodMatcher.java:52)
at org.testng.internal.Invoker.injectParameters(Invoker.java:1228)
at org.testng.internal.Invoker.invokeTestMethods(Invoker.java:1125)
at org.testng.internal.TestMethodWorker.invokeTestMethods(TestMethodWorker.java:129)
at org.testng.internal.TestMethodWorker.run(TestMethodWorker.java:112)
at org.testng.TestRunner.privateRun(TestRunner.java:778)
at org.testng.TestRunner.run(TestRunner.java:632)
at org.testng.SuiteRunner.runTest(SuiteRunner.java:366)
at org.testng.SuiteRunner.runSequentially(SuiteRunner.java:361)
at org.testng.SuiteRunner.privateRun(SuiteRunner.java:319)
at org.testng.SuiteRunner.run(SuiteRunner.java:268)
at org.testng.SuiteRunnerWorker.runSuite(SuiteRunnerWorker.java:52)
at org.testng.SuiteRunnerWorker.run(SuiteRunnerWorker.java:86)
at org.testng.TestNG.runSuitesSequentially(TestNG.java:1222)
at org.testng.TestNG.runSuitesLocally(TestNG.java:1147)
at org.testng.TestNG.runSuites(TestNG.java:1072)
at org.testng.TestNG.run(TestNG.java:1044)
at com.sun.javatest.regtest.agent.TestNGRunner.main(TestNGRunner.java:87)
at com.sun.javatest.regtest.agent.TestNGRunner.main(TestNGRunner.java:54)
at java.base/jdk.internal.reflect.NativeMethodAccessorImpl.invoke0(Native Method)
at java.base/jdk.internal.reflect.NativeMethodAccessorImpl.invoke(NativeMethodAccessorImpl.java:62)
at java.base/jdk.internal.reflect.DelegatingMethodAccessorImpl.invoke(DelegatingMethodAccessorImpl.java:43)
at java.base/java.lang.reflect.Method.invoke(Method.java:538)
at com.sun.javatest.regtest.agent.MainWrapper$MainThread.run(MainWrapper.java:110)
at java.base/java.lang.Thread.run(Thread.java:844)
test tck.java.time.format.TCKDateTimeParseResolver.test_resolveFourToDate(): failure
org.testng.internal.reflect.MethodMatcherException:
Data provider mismatch
Method: test_resolveFourToDate([Parameter{index=0, type=java.time.temporal.TemporalField, declaredAnnotations=[]}, Parameter{index=1, type=long, declaredAnnotations=[]}, Parameter{index=2, type=java.time.temporal.TemporalField, declaredAnnotations=[]}, Parameter{index=3, type=long, declaredAnnotations=[]}, Parameter{index=4, type=java.time.temporal.TemporalField, declaredAnnotations=[]}, Parameter{index=5, type=long, declaredAnnotations=[]}, Parameter{index=6, type=java.time.temporal.TemporalField, declaredAnnotations=[]}, Parameter{index=7, type=long, declaredAnnotations=[]}, Parameter{index=8, type=java.time.LocalDate, declaredAnnotations=[]}])
Arguments: [(java.time.temporal.ChronoField)Year,(java.lang.Integer)2012,(java.time.temporal.ChronoField)MonthOfYear,(java.lang.Integer)2,(java.time.temporal.ChronoField)AlignedWeekOfMonth,(java.lang.Integer)1,(java.time.temporal.ChronoField)AlignedDayOfWeekInMonth,(java.lang.Integer)1,(java.time.LocalDate)2012-02-01]
at org.testng.internal.reflect.DataProviderMethodMatcher.getConformingArguments(DataProviderMethodMatcher.java:52)
at org.testng.internal.Invoker.injectParameters(Invoker.java:1228)
at org.testng.internal.Invoker.invokeTestMethods(Invoker.java:1125)
at org.testng.internal.TestMethodWorker.invokeTestMethods(TestMethodWorker.java:129)
at org.testng.internal.TestMethodWorker.run(TestMethodWorker.java:112)
at org.testng.TestRunner.privateRun(TestRunner.java:778)
at org.testng.TestRunner.run(TestRunner.java:632)
at org.testng.SuiteRunner.runTest(SuiteRunner.java:366)
at org.testng.SuiteRunner.runSequentially(SuiteRunner.java:361)
at org.testng.SuiteRunner.privateRun(SuiteRunner.java:319)
at org.testng.SuiteRunner.run(SuiteRunner.java:268)
at org.testng.SuiteRunnerWorker.runSuite(SuiteRunnerWorker.java:52)
at org.testng.SuiteRunnerWorker.run(SuiteRunnerWorker.java:86)
at org.testng.TestNG.runSuitesSequentially(TestNG.java:1222)
at org.testng.TestNG.runSuitesLocally(TestNG.java:1147)
at org.testng.TestNG.runSuites(TestNG.java:1072)
at org.testng.TestNG.run(TestNG.java:1044)
at com.sun.javatest.regtest.agent.TestNGRunner.main(TestNGRunner.java:87)
at com.sun.javatest.regtest.agent.TestNGRunner.main(TestNGRunner.java:54)
at java.base/jdk.internal.reflect.NativeMethodAccessorImpl.invoke0(Native Method)
at java.base/jdk.internal.reflect.NativeMethodAccessorImpl.invoke(NativeMethodAccessorImpl.java:62)
at java.base/jdk.internal.reflect.DelegatingMethodAccessorImpl.invoke(DelegatingMethodAccessorImpl.java:43)
at java.base/java.lang.reflect.Method.invoke(Method.java:538)
at com.sun.javatest.regtest.agent.MainWrapper$MainThread.run(MainWrapper.java:110)
at java.base/java.lang.Thread.run(Thread.java:844)
test tck.java.time.format.TCKDateTimeParseResolver.test_resolveFourToDateTime(): failure
org.testng.internal.reflect.MethodMatcherException:
Data provider mismatch
Method: test_resolveFourToDateTime([Parameter{index=0, type=java.time.format.ResolverStyle, declaredAnnotations=[]}, Parameter{index=1, type=long, declaredAnnotations=[]}, Parameter{index=2, type=long, declaredAnnotations=[]}, Parameter{index=3, type=long, declaredAnnotations=[]}, Parameter{index=4, type=long, declaredAnnotations=[]}, Parameter{index=5, type=java.time.LocalTime, declaredAnnotations=[]}, Parameter{index=6, type=java.time.Period, declaredAnnotations=[]}])
Arguments: [null,(java.lang.Integer)0,(java.lang.Integer)0,(java.lang.Integer)0,(java.lang.Integer)0,(java.time.LocalTime)00:00,(java.time.Period)P0D]
at org.testng.internal.reflect.DataProviderMethodMatcher.getConformingArguments(DataProviderMethodMatcher.java:52)
at org.testng.internal.Invoker.injectParameters(Invoker.java:1228)
at org.testng.internal.Invoker.invokeTestMethods(Invoker.java:1125)
at org.testng.internal.TestMethodWorker.invokeTestMethods(TestMethodWorker.java:129)
at org.testng.internal.TestMethodWorker.run(TestMethodWorker.java:112)
at org.testng.TestRunner.privateRun(TestRunner.java:778)
at org.testng.TestRunner.run(TestRunner.java:632)
at org.testng.SuiteRunner.runTest(SuiteRunner.java:366)
at org.testng.SuiteRunner.runSequentially(SuiteRunner.java:361)
at org.testng.SuiteRunner.privateRun(SuiteRunner.java:319)
at org.testng.SuiteRunner.run(SuiteRunner.java:268)
at org.testng.SuiteRunnerWorker.runSuite(SuiteRunnerWorker.java:52)
at org.testng.SuiteRunnerWorker.run(SuiteRunnerWorker.java:86)
at org.testng.TestNG.runSuitesSequentially(TestNG.java:1222)
at org.testng.TestNG.runSuitesLocally(TestNG.java:1147)
at org.testng.TestNG.runSuites(TestNG.java:1072)
at org.testng.TestNG.run(TestNG.java:1044)
at com.sun.javatest.regtest.agent.TestNGRunner.main(TestNGRunner.java:87)
at com.sun.javatest.regtest.agent.TestNGRunner.main(TestNGRunner.java:54)
at java.base/jdk.internal.reflect.NativeMethodAccessorImpl.invoke0(Native Method)
at java.base/jdk.internal.reflect.NativeMethodAccessorImpl.invoke(NativeMethodAccessorImpl.java:62)
at java.base/jdk.internal.reflect.DelegatingMethodAccessorImpl.invoke(DelegatingMethodAccessorImpl.java:43)
at java.base/java.lang.reflect.Method.invoke(Method.java:538)
at com.sun.javatest.regtest.agent.MainWrapper$MainThread.run(MainWrapper.java:110)
at java.base/java.lang.Thread.run(Thread.java:844)
test tck.java.time.format.TCKDateTimeParseResolver.test_resolveFourToTime(): failure
org.testng.internal.reflect.MethodMatcherException:
Data provider mismatch
Method: test_resolveFourToTime([Parameter{index=0, type=java.time.format.ResolverStyle, declaredAnnotations=[]}, Parameter{index=1, type=long, declaredAnnotations=[]}, Parameter{index=2, type=long, declaredAnnotations=[]}, Parameter{index=3, type=long, declaredAnnotations=[]}, Parameter{index=4, type=long, declaredAnnotations=[]}, Parameter{index=5, type=java.time.LocalTime, declaredAnnotations=[]}, Parameter{index=6, type=java.time.Period, declaredAnnotations=[]}])
Arguments: [null,(java.lang.Integer)0,(java.lang.Integer)0,(java.lang.Integer)0,(java.lang.Integer)0,(java.time.LocalTime)00:00,(java.time.Period)P0D]
at org.testng.internal.reflect.DataProviderMethodMatcher.getConformingArguments(DataProviderMethodMatcher.java:52)
at org.testng.internal.Invoker.injectParameters(Invoker.java:1228)
at org.testng.internal.Invoker.invokeTestMethods(Invoker.java:1125)
at org.testng.internal.TestMethodWorker.invokeTestMethods(TestMethodWorker.java:129)
at org.testng.internal.TestMethodWorker.run(TestMethodWorker.java:112)
at org.testng.TestRunner.privateRun(TestRunner.java:778)
at org.testng.TestRunner.run(TestRunner.java:632)
at org.testng.SuiteRunner.runTest(SuiteRunner.java:366)
at org.testng.SuiteRunner.runSequentially(SuiteRunner.java:361)
at org.testng.SuiteRunner.privateRun(SuiteRunner.java:319)
at org.testng.SuiteRunner.run(SuiteRunner.java:268)
at org.testng.SuiteRunnerWorker.runSuite(SuiteRunnerWorker.java:52)
at org.testng.SuiteRunnerWorker.run(SuiteRunnerWorker.java:86)
at org.testng.TestNG.runSuitesSequentially(TestNG.java:1222)
at org.testng.TestNG.runSuitesLocally(TestNG.java:1147)
at org.testng.TestNG.runSuites(TestNG.java:1072)
at org.testng.TestNG.run(TestNG.java:1044)
at com.sun.javatest.regtest.agent.TestNGRunner.main(TestNGRunner.java:87)
at com.sun.javatest.regtest.agent.TestNGRunner.main(TestNGRunner.java:54)
at java.base/jdk.internal.reflect.NativeMethodAccessorImpl.invoke0(Native Method)
at java.base/jdk.internal.reflect.NativeMethodAccessorImpl.invoke(NativeMethodAccessorImpl.java:62)
at java.base/jdk.internal.reflect.DelegatingMethodAccessorImpl.invoke(DelegatingMethodAccessorImpl.java:43)
at java.base/java.lang.reflect.Method.invoke(Method.java:538)
at com.sun.javatest.regtest.agent.MainWrapper$MainThread.run(MainWrapper.java:110)
at java.base/java.lang.Thread.run(Thread.java:844)
test tck.java.time.format.TCKDateTimeParseResolver.test_resolveMinuteOfDay(): failure
org.testng.internal.reflect.MethodMatcherException:
Data provider mismatch
Method: test_resolveMinuteOfDay([Parameter{index=0, type=java.time.format.ResolverStyle, declaredAnnotations=[]}, Parameter{index=1, type=long, declaredAnnotations=[]}, Parameter{index=2, type=java.lang.Integer, declaredAnnotations=[]}, Parameter{index=3, type=int, declaredAnnotations=[]}])
Arguments: [(java.time.format.ResolverStyle)STRICT,(java.lang.Integer)0,(java.lang.Integer)0,(java.lang.Integer)0]
at org.testng.internal.reflect.DataProviderMethodMatcher.getConformingArguments(DataProviderMethodMatcher.java:52)
at org.testng.internal.Invoker.injectParameters(Invoker.java:1228)
at org.testng.internal.Invoker.invokeTestMethods(Invoker.java:1125)
at org.testng.internal.TestMethodWorker.invokeTestMethods(TestMethodWorker.java:129)
at org.testng.internal.TestMethodWorker.run(TestMethodWorker.java:112)
at org.testng.TestRunner.privateRun(TestRunner.java:778)
at org.testng.TestRunner.run(TestRunner.java:632)
at org.testng.SuiteRunner.runTest(SuiteRunner.java:366)
at org.testng.SuiteRunner.runSequentially(SuiteRunner.java:361)
at org.testng.SuiteRunner.privateRun(SuiteRunner.java:319)
at org.testng.SuiteRunner.run(SuiteRunner.java:268)
at org.testng.SuiteRunnerWorker.runSuite(SuiteRunnerWorker.java:52)
at org.testng.SuiteRunnerWorker.run(SuiteRunnerWorker.java:86)
at org.testng.TestNG.runSuitesSequentially(TestNG.java:1222)
at org.testng.TestNG.runSuitesLocally(TestNG.java:1147)
at org.testng.TestNG.runSuites(TestNG.java:1072)
at org.testng.TestNG.run(TestNG.java:1044)
at com.sun.javatest.regtest.agent.TestNGRunner.main(TestNGRunner.java:87)
at com.sun.javatest.regtest.agent.TestNGRunner.main(TestNGRunner.java:54)
at java.base/jdk.internal.reflect.NativeMethodAccessorImpl.invoke0(Native Method)
at java.base/jdk.internal.reflect.NativeMethodAccessorImpl.invoke(NativeMethodAccessorImpl.java:62)
at java.base/jdk.internal.reflect.DelegatingMethodAccessorImpl.invoke(DelegatingMethodAccessorImpl.java:43)
at java.base/java.lang.reflect.Method.invoke(Method.java:538)
at com.sun.javatest.regtest.agent.MainWrapper$MainThread.run(MainWrapper.java:110)
at java.base/java.lang.Thread.run(Thread.java:844)
test tck.java.time.format.TCKDateTimeParseResolver.test_resolveOneNoChange(): failure
org.testng.internal.reflect.MethodMatcherException:
Data provider mismatch
Method: test_resolveOneNoChange([Parameter{index=0, type=java.time.temporal.TemporalField, declaredAnnotations=[]}, Parameter{index=1, type=long, declaredAnnotations=[]}])
Arguments: [(java.time.temporal.ChronoField)Year,(java.lang.Integer)2012]
at org.testng.internal.reflect.DataProviderMethodMatcher.getConformingArguments(DataProviderMethodMatcher.java:52)
at org.testng.internal.Invoker.injectParameters(Invoker.java:1228)
at org.testng.internal.Invoker.invokeTestMethods(Invoker.java:1125)
at org.testng.internal.TestMethodWorker.invokeTestMethods(TestMethodWorker.java:129)
at org.testng.internal.TestMethodWorker.run(TestMethodWorker.java:112)
at org.testng.TestRunner.privateRun(TestRunner.java:778)
at org.testng.TestRunner.run(TestRunner.java:632)
at org.testng.SuiteRunner.runTest(SuiteRunner.java:366)
at org.testng.SuiteRunner.runSequentially(SuiteRunner.java:361)
at org.testng.SuiteRunner.privateRun(SuiteRunner.java:319)
at org.testng.SuiteRunner.run(SuiteRunner.java:268)
at org.testng.SuiteRunnerWorker.runSuite(SuiteRunnerWorker.java:52)
at org.testng.SuiteRunnerWorker.run(SuiteRunnerWorker.java:86)
at org.testng.TestNG.runSuitesSequentially(TestNG.java:1222)
at org.testng.TestNG.runSuitesLocally(TestNG.java:1147)
at org.testng.TestNG.runSuites(TestNG.java:1072)
at org.testng.TestNG.run(TestNG.java:1044)
at com.sun.javatest.regtest.agent.TestNGRunner.main(TestNGRunner.java:87)
at com.sun.javatest.regtest.agent.TestNGRunner.main(TestNGRunner.java:54)
at java.base/jdk.internal.reflect.NativeMethodAccessorImpl.invoke0(Native Method)
at java.base/jdk.internal.reflect.NativeMethodAccessorImpl.invoke(NativeMethodAccessorImpl.java:62)
at java.base/jdk.internal.reflect.DelegatingMethodAccessorImpl.invoke(DelegatingMethodAccessorImpl.java:43)
at java.base/java.lang.reflect.Method.invoke(Method.java:538)
at com.sun.javatest.regtest.agent.MainWrapper$MainThread.run(MainWrapper.java:110)
at java.base/java.lang.Thread.run(Thread.java:844)
test tck.java.time.format.TCKDateTimeParseResolver.test_resolveOneToDate(): failure
org.testng.internal.reflect.MethodMatcherException:
Data provider mismatch
Method: test_resolveOneToDate([Parameter{index=0, type=java.time.temporal.TemporalField, declaredAnnotations=[]}, Parameter{index=1, type=long, declaredAnnotations=[]}, Parameter{index=2, type=java.time.LocalDate, declaredAnnotations=[]}])
Arguments: [(java.time.temporal.ChronoField)EpochDay,(java.lang.Integer)32,(java.time.LocalDate)1970-02-02]
at org.testng.internal.reflect.DataProviderMethodMatcher.getConformingArguments(DataProviderMethodMatcher.java:52)
at org.testng.internal.Invoker.injectParameters(Invoker.java:1228)
at org.testng.internal.Invoker.invokeTestMethods(Invoker.java:1125)
at org.testng.internal.TestMethodWorker.invokeTestMethods(TestMethodWorker.java:129)
at org.testng.internal.TestMethodWorker.run(TestMethodWorker.java:112)
at org.testng.TestRunner.privateRun(TestRunner.java:778)
at org.testng.TestRunner.run(TestRunner.java:632)
at org.testng.SuiteRunner.runTest(SuiteRunner.java:366)
at org.testng.SuiteRunner.runSequentially(SuiteRunner.java:361)
at org.testng.SuiteRunner.privateRun(SuiteRunner.java:319)
at org.testng.SuiteRunner.run(SuiteRunner.java:268)
at org.testng.SuiteRunnerWorker.runSuite(SuiteRunnerWorker.java:52)
at org.testng.SuiteRunnerWorker.run(SuiteRunnerWorker.java:86)
at org.testng.TestNG.runSuitesSequentially(TestNG.java:1222)
at org.testng.TestNG.runSuitesLocally(TestNG.java:1147)
at org.testng.TestNG.runSuites(TestNG.java:1072)
at org.testng.TestNG.run(TestNG.java:1044)
at com.sun.javatest.regtest.agent.TestNGRunner.main(TestNGRunner.java:87)
at com.sun.javatest.regtest.agent.TestNGRunner.main(TestNGRunner.java:54)
at java.base/jdk.internal.reflect.NativeMethodAccessorImpl.invoke0(Native Method)
at java.base/jdk.internal.reflect.NativeMethodAccessorImpl.invoke(NativeMethodAccessorImpl.java:62)
at java.base/jdk.internal.reflect.DelegatingMethodAccessorImpl.invoke(DelegatingMethodAccessorImpl.java:43)
at java.base/java.lang.reflect.Method.invoke(Method.java:538)
at com.sun.javatest.regtest.agent.MainWrapper$MainThread.run(MainWrapper.java:110)
at java.base/java.lang.Thread.run(Thread.java:844)
test tck.java.time.format.TCKDateTimeParseResolver.test_resolveOneToField(): failure
org.testng.internal.reflect.MethodMatcherException:
Data provider mismatch
Method: test_resolveOneToField([Parameter{index=0, type=java.time.temporal.TemporalField, declaredAnnotations=[]}, Parameter{index=1, type=long, declaredAnnotations=[]}, Parameter{index=2, type=java.time.temporal.TemporalField, declaredAnnotations=[]}, Parameter{index=3, type=java.lang.Long, declaredAnnotations=[]}, Parameter{index=4, type=java.time.temporal.TemporalField, declaredAnnotations=[]}, Parameter{index=5, type=java.lang.Long, declaredAnnotations=[]}])
Arguments: [(java.time.temporal.ChronoField)YearOfEra,(java.lang.Integer)2012,(java.time.temporal.ChronoField)Year,(java.lang.Long)2012,null,null]
at org.testng.internal.reflect.DataProviderMethodMatcher.getConformingArguments(DataProviderMethodMatcher.java:52)
at org.testng.internal.Invoker.injectParameters(Invoker.java:1228)
at org.testng.internal.Invoker.invokeTestMethods(Invoker.java:1125)
at org.testng.internal.TestMethodWorker.invokeTestMethods(TestMethodWorker.java:129)
at org.testng.internal.TestMethodWorker.run(TestMethodWorker.java:112)
at org.testng.TestRunner.privateRun(TestRunner.java:778)
at org.testng.TestRunner.run(TestRunner.java:632)
at org.testng.SuiteRunner.runTest(SuiteRunner.java:366)
at org.testng.SuiteRunner.runSequentially(SuiteRunner.java:361)
at org.testng.SuiteRunner.privateRun(SuiteRunner.java:319)
at org.testng.SuiteRunner.run(SuiteRunner.java:268)
at org.testng.SuiteRunnerWorker.runSuite(SuiteRunnerWorker.java:52)
at org.testng.SuiteRunnerWorker.run(SuiteRunnerWorker.java:86)
at org.testng.TestNG.runSuitesSequentially(TestNG.java:1222)
at org.testng.TestNG.runSuitesLocally(TestNG.java:1147)
at org.testng.TestNG.runSuites(TestNG.java:1072)
at org.testng.TestNG.run(TestNG.java:1044)
at com.sun.javatest.regtest.agent.TestNGRunner.main(TestNGRunner.java:87)
at com.sun.javatest.regtest.agent.TestNGRunner.main(TestNGRunner.java:54)
at java.base/jdk.internal.reflect.NativeMethodAccessorImpl.invoke0(Native Method)
at java.base/jdk.internal.reflect.NativeMethodAccessorImpl.invoke(NativeMethodAccessorImpl.java:62)
at java.base/jdk.internal.reflect.DelegatingMethodAccessorImpl.invoke(DelegatingMethodAccessorImpl.java:43)
at java.base/java.lang.reflect.Method.invoke(Method.java:538)
at com.sun.javatest.regtest.agent.MainWrapper$MainThread.run(MainWrapper.java:110)
at java.base/java.lang.Thread.run(Thread.java:844)
test tck.java.time.format.TCKDateTimeParseResolver.test_resolveOneToTime(): failure
org.testng.internal.reflect.MethodMatcherException:
Data provider mismatch
Method: test_resolveOneToTime([Parameter{index=0, type=java.time.temporal.TemporalField, declaredAnnotations=[]}, Parameter{index=1, type=long, declaredAnnotations=[]}, Parameter{index=2, type=java.time.LocalTime, declaredAnnotations=[]}])
Arguments: [(java.time.temporal.ChronoField)HourOfDay,(java.lang.Integer)8,(java.time.LocalTime)08:00]
at org.testng.internal.reflect.DataProviderMethodMatcher.getConformingArguments(DataProviderMethodMatcher.java:52)
at org.testng.internal.Invoker.injectParameters(Invoker.java:1228)
at org.testng.internal.Invoker.invokeTestMethods(Invoker.java:1125)
at org.testng.internal.TestMethodWorker.invokeTestMethods(TestMethodWorker.java:129)
at org.testng.internal.TestMethodWorker.run(TestMethodWorker.java:112)
at org.testng.TestRunner.privateRun(TestRunner.java:778)
at org.testng.TestRunner.run(TestRunner.java:632)
at org.testng.SuiteRunner.runTest(SuiteRunner.java:366)
at org.testng.SuiteRunner.runSequentially(SuiteRunner.java:361)
at org.testng.SuiteRunner.privateRun(SuiteRunner.java:319)
at org.testng.SuiteRunner.run(SuiteRunner.java:268)
at org.testng.SuiteRunnerWorker.runSuite(SuiteRunnerWorker.java:52)
at org.testng.SuiteRunnerWorker.run(SuiteRunnerWorker.java:86)
at org.testng.TestNG.runSuitesSequentially(TestNG.java:1222)
at org.testng.TestNG.runSuitesLocally(TestNG.java:1147)
at org.testng.TestNG.runSuites(TestNG.java:1072)
at org.testng.TestNG.run(TestNG.java:1044)
at com.sun.javatest.regtest.agent.TestNGRunner.main(TestNGRunner.java:87)
at com.sun.javatest.regtest.agent.TestNGRunner.main(TestNGRunner.java:54)
at java.base/jdk.internal.reflect.NativeMethodAccessorImpl.invoke0(Native Method)
at java.base/jdk.internal.reflect.NativeMethodAccessorImpl.invoke(NativeMethodAccessorImpl.java:62)
at java.base/jdk.internal.reflect.DelegatingMethodAccessorImpl.invoke(DelegatingMethodAccessorImpl.java:43)
at java.base/java.lang.reflect.Method.invoke(Method.java:538)
at com.sun.javatest.regtest.agent.MainWrapper$MainThread.run(MainWrapper.java:110)
at java.base/java.lang.Thread.run(Thread.java:844)
test tck.java.time.format.TCKDateTimeParseResolver.test_resolveSecondOfDay(): failure
org.testng.internal.reflect.MethodMatcherException:
Data provider mismatch
Method: test_resolveSecondOfDay([Parameter{index=0, type=java.time.format.ResolverStyle, declaredAnnotations=[]}, Parameter{index=1, type=long, declaredAnnotations=[]}, Parameter{index=2, type=java.lang.Integer, declaredAnnotations=[]}, Parameter{index=3, type=int, declaredAnnotations=[]}])
Arguments: [(java.time.format.ResolverStyle)STRICT,(java.lang.Integer)0,(java.lang.Integer)0,(java.lang.Integer)0]
at org.testng.internal.reflect.DataProviderMethodMatcher.getConformingArguments(DataProviderMethodMatcher.java:52)
at org.testng.internal.Invoker.injectParameters(Invoker.java:1228)
at org.testng.internal.Invoker.invokeTestMethods(Invoker.java:1125)
at org.testng.internal.TestMethodWorker.invokeTestMethods(TestMethodWorker.java:129)
at org.testng.internal.TestMethodWorker.run(TestMethodWorker.java:112)
at org.testng.TestRunner.privateRun(TestRunner.java:778)
at org.testng.TestRunner.run(TestRunner.java:632)
at org.testng.SuiteRunner.runTest(SuiteRunner.java:366)
at org.testng.SuiteRunner.runSequentially(SuiteRunner.java:361)
at org.testng.SuiteRunner.privateRun(SuiteRunner.java:319)
at org.testng.SuiteRunner.run(SuiteRunner.java:268)
at org.testng.SuiteRunnerWorker.runSuite(SuiteRunnerWorker.java:52)
at org.testng.SuiteRunnerWorker.run(SuiteRunnerWorker.java:86)
at org.testng.TestNG.runSuitesSequentially(TestNG.java:1222)
at org.testng.TestNG.runSuitesLocally(TestNG.java:1147)
at org.testng.TestNG.runSuites(TestNG.java:1072)
at org.testng.TestNG.run(TestNG.java:1044)
at com.sun.javatest.regtest.agent.TestNGRunner.main(TestNGRunner.java:87)
at com.sun.javatest.regtest.agent.TestNGRunner.main(TestNGRunner.java:54)
at java.base/jdk.internal.reflect.NativeMethodAccessorImpl.invoke0(Native Method)
at java.base/jdk.internal.reflect.NativeMethodAccessorImpl.invoke(NativeMethodAccessorImpl.java:62)
at java.base/jdk.internal.reflect.DelegatingMethodAccessorImpl.invoke(DelegatingMethodAccessorImpl.java:43)
at java.base/java.lang.reflect.Method.invoke(Method.java:538)
at com.sun.javatest.regtest.agent.MainWrapper$MainThread.run(MainWrapper.java:110)
at java.base/java.lang.Thread.run(Thread.java:844)
test tck.java.time.format.TCKDateTimeParseResolver.test_resolveThreeNoChange(): failure
org.testng.internal.reflect.MethodMatcherException:
Data provider mismatch
Method: test_resolveThreeNoChange([Parameter{index=0, type=java.time.temporal.TemporalField, declaredAnnotations=[]}, Parameter{index=1, type=long, declaredAnnotations=[]}, Parameter{index=2, type=java.time.temporal.TemporalField, declaredAnnotations=[]}, Parameter{index=3, type=long, declaredAnnotations=[]}, Parameter{index=4, type=java.time.temporal.TemporalField, declaredAnnotations=[]}, Parameter{index=5, type=long, declaredAnnotations=[]}])
Arguments: [(java.time.temporal.ChronoField)Year,(java.lang.Integer)2012,(java.time.temporal.ChronoField)MonthOfYear,(java.lang.Integer)5,(java.time.temporal.ChronoField)DayOfWeek,(java.lang.Integer)5]
at org.testng.internal.reflect.DataProviderMethodMatcher.getConformingArguments(DataProviderMethodMatcher.java:52)
at org.testng.internal.Invoker.injectParameters(Invoker.java:1228)
at org.testng.internal.Invoker.invokeTestMethods(Invoker.java:1125)
at org.testng.internal.TestMethodWorker.invokeTestMethods(TestMethodWorker.java:129)
at org.testng.internal.TestMethodWorker.run(TestMethodWorker.java:112)
at org.testng.TestRunner.privateRun(TestRunner.java:778)
at org.testng.TestRunner.run(TestRunner.java:632)
at org.testng.SuiteRunner.runTest(SuiteRunner.java:366)
at org.testng.SuiteRunner.runSequentially(SuiteRunner.java:361)
at org.testng.SuiteRunner.privateRun(SuiteRunner.java:319)
at org.testng.SuiteRunner.run(SuiteRunner.java:268)
at org.testng.SuiteRunnerWorker.runSuite(SuiteRunnerWorker.java:52)
at org.testng.SuiteRunnerWorker.run(SuiteRunnerWorker.java:86)
at org.testng.TestNG.runSuitesSequentially(TestNG.java:1222)
at org.testng.TestNG.runSuitesLocally(TestNG.java:1147)
at org.testng.TestNG.runSuites(TestNG.java:1072)
at org.testng.TestNG.run(TestNG.java:1044)
at com.sun.javatest.regtest.agent.TestNGRunner.main(TestNGRunner.java:87)
at com.sun.javatest.regtest.agent.TestNGRunner.main(TestNGRunner.java:54)
at java.base/jdk.internal.reflect.NativeMethodAccessorImpl.invoke0(Native Method)
at java.base/jdk.internal.reflect.NativeMethodAccessorImpl.invoke(NativeMethodAccessorImpl.java:62)
at java.base/jdk.internal.reflect.DelegatingMethodAccessorImpl.invoke(DelegatingMethodAccessorImpl.java:43)
at java.base/java.lang.reflect.Method.invoke(Method.java:538)
at com.sun.javatest.regtest.agent.MainWrapper$MainThread.run(MainWrapper.java:110)
at java.base/java.lang.Thread.run(Thread.java:844)
test tck.java.time.format.TCKDateTimeParseResolver.test_resolveThreeToDate(): failure
org.testng.internal.reflect.MethodMatcherException:
Data provider mismatch
Method: test_resolveThreeToDate([Parameter{index=0, type=java.time.temporal.TemporalField, declaredAnnotations=[]}, Parameter{index=1, type=long, declaredAnnotations=[]}, Parameter{index=2, type=java.time.temporal.TemporalField, declaredAnnotations=[]}, Parameter{index=3, type=long, declaredAnnotations=[]}, Parameter{index=4, type=java.time.temporal.TemporalField, declaredAnnotations=[]}, Parameter{index=5, type=long, declaredAnnotations=[]}, Parameter{index=6, type=java.time.LocalDate, declaredAnnotations=[]}])
Arguments: [(java.time.temporal.ChronoField)Year,(java.lang.Integer)2012,(java.time.temporal.ChronoField)MonthOfYear,(java.lang.Integer)2,(java.time.temporal.ChronoField)DayOfMonth,(java.lang.Integer)1,(java.time.LocalDate)2012-02-01]
at org.testng.internal.reflect.DataProviderMethodMatcher.getConformingArguments(DataProviderMethodMatcher.java:52)
at org.testng.internal.Invoker.injectParameters(Invoker.java:1228)
at org.testng.internal.Invoker.invokeTestMethods(Invoker.java:1125)
at org.testng.internal.TestMethodWorker.invokeTestMethods(TestMethodWorker.java:129)
at org.testng.internal.TestMethodWorker.run(TestMethodWorker.java:112)
at org.testng.TestRunner.privateRun(TestRunner.java:778)
at org.testng.TestRunner.run(TestRunner.java:632)
at org.testng.SuiteRunner.runTest(SuiteRunner.java:366)
at org.testng.SuiteRunner.runSequentially(SuiteRunner.java:361)
at org.testng.SuiteRunner.privateRun(SuiteRunner.java:319)
at org.testng.SuiteRunner.run(SuiteRunner.java:268)
at org.testng.SuiteRunnerWorker.runSuite(SuiteRunnerWorker.java:52)
at org.testng.SuiteRunnerWorker.run(SuiteRunnerWorker.java:86)
at org.testng.TestNG.runSuitesSequentially(TestNG.java:1222)
at org.testng.TestNG.runSuitesLocally(TestNG.java:1147)
at org.testng.TestNG.runSuites(TestNG.java:1072)
at org.testng.TestNG.run(TestNG.java:1044)
at com.sun.javatest.regtest.agent.TestNGRunner.main(TestNGRunner.java:87)
at com.sun.javatest.regtest.agent.TestNGRunner.main(TestNGRunner.java:54)
at java.base/jdk.internal.reflect.NativeMethodAccessorImpl.invoke0(Native Method)
at java.base/jdk.internal.reflect.NativeMethodAccessorImpl.invoke(NativeMethodAccessorImpl.java:62)
at java.base/jdk.internal.reflect.DelegatingMethodAccessorImpl.invoke(DelegatingMethodAccessorImpl.java:43)
at java.base/java.lang.reflect.Method.invoke(Method.java:538)
at com.sun.javatest.regtest.agent.MainWrapper$MainThread.run(MainWrapper.java:110)
at java.base/java.lang.Thread.run(Thread.java:844)
test tck.java.time.format.TCKDateTimeParseResolver.test_resolveThreeToTime(): failure
org.testng.internal.reflect.MethodMatcherException:
Data provider mismatch
Method: test_resolveThreeToTime([Parameter{index=0, type=java.time.format.ResolverStyle, declaredAnnotations=[]}, Parameter{index=1, type=long, declaredAnnotations=[]}, Parameter{index=2, type=long, declaredAnnotations=[]}, Parameter{index=3, type=long, declaredAnnotations=[]}, Parameter{index=4, type=long, declaredAnnotations=[]}, Parameter{index=5, type=java.time.LocalTime, declaredAnnotations=[]}, Parameter{index=6, type=java.time.Period, declaredAnnotations=[]}])
Arguments: [null,(java.lang.Integer)0,(java.lang.Integer)0,(java.lang.Integer)0,(java.lang.Integer)0,(java.time.LocalTime)00:00,(java.time.Period)P0D]
at org.testng.internal.reflect.DataProviderMethodMatcher.getConformingArguments(DataProviderMethodMatcher.java:52)
at org.testng.internal.Invoker.injectParameters(Invoker.java:1228)
at org.testng.internal.Invoker.invokeTestMethods(Invoker.java:1125)
at org.testng.internal.TestMethodWorker.invokeTestMethods(TestMethodWorker.java:129)
at org.testng.internal.TestMethodWorker.run(TestMethodWorker.java:112)
at org.testng.TestRunner.privateRun(TestRunner.java:778)
at org.testng.TestRunner.run(TestRunner.java:632)
at org.testng.SuiteRunner.runTest(SuiteRunner.java:366)
at org.testng.SuiteRunner.runSequentially(SuiteRunner.java:361)
at org.testng.SuiteRunner.privateRun(SuiteRunner.java:319)
at org.testng.SuiteRunner.run(SuiteRunner.java:268)
at org.testng.SuiteRunnerWorker.runSuite(SuiteRunnerWorker.java:52)
at org.testng.SuiteRunnerWorker.run(SuiteRunnerWorker.java:86)
at org.testng.TestNG.runSuitesSequentially(TestNG.java:1222)
at org.testng.TestNG.runSuitesLocally(TestNG.java:1147)
at org.testng.TestNG.runSuites(TestNG.java:1072)
at org.testng.TestNG.run(TestNG.java:1044)
at com.sun.javatest.regtest.agent.TestNGRunner.main(TestNGRunner.java:87)
at com.sun.javatest.regtest.agent.TestNGRunner.main(TestNGRunner.java:54)
at java.base/jdk.internal.reflect.NativeMethodAccessorImpl.invoke0(Native Method)
at java.base/jdk.internal.reflect.NativeMethodAccessorImpl.invoke(NativeMethodAccessorImpl.java:62)
at java.base/jdk.internal.reflect.DelegatingMethodAccessorImpl.invoke(DelegatingMethodAccessorImpl.java:43)
at java.base/java.lang.reflect.Method.invoke(Method.java:538)
at com.sun.javatest.regtest.agent.MainWrapper$MainThread.run(MainWrapper.java:110)
at java.base/java.lang.Thread.run(Thread.java:844)
test tck.java.time.format.TCKDateTimeParseResolver.test_resolveTwoNoChange(): failure
org.testng.internal.reflect.MethodMatcherException:
Data provider mismatch
Method: test_resolveTwoNoChange([Parameter{index=0, type=java.time.temporal.TemporalField, declaredAnnotations=[]}, Parameter{index=1, type=long, declaredAnnotations=[]}, Parameter{index=2, type=java.time.temporal.TemporalField, declaredAnnotations=[]}, Parameter{index=3, type=long, declaredAnnotations=[]}])
Arguments: [(java.time.temporal.ChronoField)Year,(java.lang.Integer)2012,(java.time.temporal.ChronoField)MonthOfYear,(java.lang.Integer)5]
at org.testng.internal.reflect.DataProviderMethodMatcher.getConformingArguments(DataProviderMethodMatcher.java:52)
at org.testng.internal.Invoker.injectParameters(Invoker.java:1228)
at org.testng.internal.Invoker.invokeTestMethods(Invoker.java:1125)
at org.testng.internal.TestMethodWorker.invokeTestMethods(TestMethodWorker.java:129)
at org.testng.internal.TestMethodWorker.run(TestMethodWorker.java:112)
at org.testng.TestRunner.privateRun(TestRunner.java:778)
at org.testng.TestRunner.run(TestRunner.java:632)
at org.testng.SuiteRunner.runTest(SuiteRunner.java:366)
at org.testng.SuiteRunner.runSequentially(SuiteRunner.java:361)
at org.testng.SuiteRunner.privateRun(SuiteRunner.java:319)
at org.testng.SuiteRunner.run(SuiteRunner.java:268)
at org.testng.SuiteRunnerWorker.runSuite(SuiteRunnerWorker.java:52)
at org.testng.SuiteRunnerWorker.run(SuiteRunnerWorker.java:86)
at org.testng.TestNG.runSuitesSequentially(TestNG.java:1222)
at org.testng.TestNG.runSuitesLocally(TestNG.java:1147)
at org.testng.TestNG.runSuites(TestNG.java:1072)
at org.testng.TestNG.run(TestNG.java:1044)
at com.sun.javatest.regtest.agent.TestNGRunner.main(TestNGRunner.java:87)
at com.sun.javatest.regtest.agent.TestNGRunner.main(TestNGRunner.java:54)
at java.base/jdk.internal.reflect.NativeMethodAccessorImpl.invoke0(Native Method)
at java.base/jdk.internal.reflect.NativeMethodAccessorImpl.invoke(NativeMethodAccessorImpl.java:62)
at java.base/jdk.internal.reflect.DelegatingMethodAccessorImpl.invoke(DelegatingMethodAccessorImpl.java:43)
at java.base/java.lang.reflect.Method.invoke(Method.java:538)
at com.sun.javatest.regtest.agent.MainWrapper$MainThread.run(MainWrapper.java:110)
at java.base/java.lang.Thread.run(Thread.java:844)
test tck.java.time.format.TCKDateTimeParseResolver.test_resolveTwoToDate(): failure
org.testng.internal.reflect.MethodMatcherException:
Data provider mismatch
Method: test_resolveTwoToDate([Parameter{index=0, type=java.time.temporal.TemporalField, declaredAnnotations=[]}, Parameter{index=1, type=long, declaredAnnotations=[]}, Parameter{index=2, type=java.time.temporal.TemporalField, declaredAnnotations=[]}, Parameter{index=3, type=long, declaredAnnotations=[]}, Parameter{index=4, type=java.time.LocalDate, declaredAnnotations=[]}])
Arguments: [(java.time.temporal.ChronoField)Year,(java.lang.Integer)2012,(java.time.temporal.ChronoField)DayOfYear,(java.lang.Integer)32,(java.time.LocalDate)2012-02-01]
at org.testng.internal.reflect.DataProviderMethodMatcher.getConformingArguments(DataProviderMethodMatcher.java:52)
at org.testng.internal.Invoker.injectParameters(Invoker.java:1228)
at org.testng.internal.Invoker.invokeTestMethods(Invoker.java:1125)
at org.testng.internal.TestMethodWorker.invokeTestMethods(TestMethodWorker.java:129)
at org.testng.internal.TestMethodWorker.run(TestMethodWorker.java:112)
at org.testng.TestRunner.privateRun(TestRunner.java:778)
at org.testng.TestRunner.run(TestRunner.java:632)
at org.testng.SuiteRunner.runTest(SuiteRunner.java:366)
at org.testng.SuiteRunner.runSequentially(SuiteRunner.java:361)
at org.testng.SuiteRunner.privateRun(SuiteRunner.java:319)
at org.testng.SuiteRunner.run(SuiteRunner.java:268)
at org.testng.SuiteRunnerWorker.runSuite(SuiteRunnerWorker.java:52)
at org.testng.SuiteRunnerWorker.run(SuiteRunnerWorker.java:86)
at org.testng.TestNG.runSuitesSequentially(TestNG.java:1222)
at org.testng.TestNG.runSuitesLocally(TestNG.java:1147)
at org.testng.TestNG.runSuites(TestNG.java:1072)
at org.testng.TestNG.run(TestNG.java:1044)
at com.sun.javatest.regtest.agent.TestNGRunner.main(TestNGRunner.java:87)
at com.sun.javatest.regtest.agent.TestNGRunner.main(TestNGRunner.java:54)
at java.base/jdk.internal.reflect.NativeMethodAccessorImpl.invoke0(Native Method)
at java.base/jdk.internal.reflect.NativeMethodAccessorImpl.invoke(NativeMethodAccessorImpl.java:62)
at java.base/jdk.internal.reflect.DelegatingMethodAccessorImpl.invoke(DelegatingMethodAccessorImpl.java:43)
at java.base/java.lang.reflect.Method.invoke(Method.java:538)
at com.sun.javatest.regtest.agent.MainWrapper$MainThread.run(MainWrapper.java:110)
at java.base/java.lang.Thread.run(Thread.java:844)
test tck.java.time.format.TCKDateTimeParseResolver.test_resolveTwoToField(): failure
org.testng.internal.reflect.MethodMatcherException:
Data provider mismatch
Method: test_resolveTwoToField([Parameter{index=0, type=java.time.temporal.TemporalField, declaredAnnotations=[]}, Parameter{index=1, type=long, declaredAnnotations=[]}, Parameter{index=2, type=java.time.temporal.TemporalField, declaredAnnotations=[]}, Parameter{index=3, type=long, declaredAnnotations=[]}, Parameter{index=4, type=java.time.temporal.TemporalField, declaredAnnotations=[]}, Parameter{index=5, type=java.lang.Long, declaredAnnotations=[]}, Parameter{index=6, type=java.time.temporal.TemporalField, declaredAnnotations=[]}, Parameter{index=7, type=java.lang.Long, declaredAnnotations=[]}])
Arguments: [(java.time.temporal.ChronoField)ProlepticMonth,(java.lang.Long)24146,(java.time.temporal.ChronoField)Year,(java.lang.Integer)2012,(java.time.temporal.ChronoField)Year,(java.lang.Long)2012,(java.time.temporal.ChronoField)MonthOfYear,(java.lang.Long)3]
at org.testng.internal.reflect.DataProviderMethodMatcher.getConformingArguments(DataProviderMethodMatcher.java:52)
at org.testng.internal.Invoker.injectParameters(Invoker.java:1228)
at org.testng.internal.Invoker.invokeTestMethods(Invoker.java:1125)
at org.testng.internal.TestMethodWorker.invokeTestMethods(TestMethodWorker.java:129)
at org.testng.internal.TestMethodWorker.run(TestMethodWorker.java:112)
at org.testng.TestRunner.privateRun(TestRunner.java:778)
at org.testng.TestRunner.run(TestRunner.java:632)
at org.testng.SuiteRunner.runTest(SuiteRunner.java:366)
at org.testng.SuiteRunner.runSequentially(SuiteRunner.java:361)
at org.testng.SuiteRunner.privateRun(SuiteRunner.java:319)
at org.testng.SuiteRunner.run(SuiteRunner.java:268)
at org.testng.SuiteRunnerWorker.runSuite(SuiteRunnerWorker.java:52)
at org.testng.SuiteRunnerWorker.run(SuiteRunnerWorker.java:86)
at org.testng.TestNG.runSuitesSequentially(TestNG.java:1222)
at org.testng.TestNG.runSuitesLocally(TestNG.java:1147)
at org.testng.TestNG.runSuites(TestNG.java:1072)
at org.testng.TestNG.run(TestNG.java:1044)
at com.sun.javatest.regtest.agent.TestNGRunner.main(TestNGRunner.java:87)
at com.sun.javatest.regtest.agent.TestNGRunner.main(TestNGRunner.java:54)
at java.base/jdk.internal.reflect.NativeMethodAccessorImpl.invoke0(Native Method)
at java.base/jdk.internal.reflect.NativeMethodAccessorImpl.invoke(NativeMethodAccessorImpl.java:62)
at java.base/jdk.internal.reflect.DelegatingMethodAccessorImpl.invoke(DelegatingMethodAccessorImpl.java:43)
at java.base/java.lang.reflect.Method.invoke(Method.java:538)
at com.sun.javatest.regtest.agent.MainWrapper$MainThread.run(MainWrapper.java:110)
at java.base/java.lang.Thread.run(Thread.java:844)
test tck.java.time.format.TCKDateTimeParseResolver.test_resolveTwoToTime(): failure
org.testng.internal.reflect.MethodMatcherException:
Data provider mismatch
Method: test_resolveTwoToTime([Parameter{index=0, type=java.time.temporal.TemporalField, declaredAnnotations=[]}, Parameter{index=1, type=long, declaredAnnotations=[]}, Parameter{index=2, type=java.time.temporal.TemporalField, declaredAnnotations=[]}, Parameter{index=3, type=long, declaredAnnotations=[]}, Parameter{index=4, type=java.time.LocalTime, declaredAnnotations=[]}])
Arguments: [(java.time.temporal.ChronoField)HourOfDay,(java.lang.Integer)8,(java.time.temporal.ChronoField)MinuteOfHour,(java.lang.Integer)6,(java.time.LocalTime)08:06]
at org.testng.internal.reflect.DataProviderMethodMatcher.getConformingArguments(DataProviderMethodMatcher.java:52)
at org.testng.internal.Invoker.injectParameters(Invoker.java:1228)
at org.testng.internal.Invoker.invokeTestMethods(Invoker.java:1125)
at org.testng.internal.TestMethodWorker.invokeTestMethods(TestMethodWorker.java:129)
at org.testng.internal.TestMethodWorker.run(TestMethodWorker.java:112)
at org.testng.TestRunner.privateRun(TestRunner.java:778)
at org.testng.TestRunner.run(TestRunner.java:632)
at org.testng.SuiteRunner.runTest(SuiteRunner.java:366)
at org.testng.SuiteRunner.runSequentially(SuiteRunner.java:361)
at org.testng.SuiteRunner.privateRun(SuiteRunner.java:319)
at org.testng.SuiteRunner.run(SuiteRunner.java:268)
at org.testng.SuiteRunnerWorker.runSuite(SuiteRunnerWorker.java:52)
at org.testng.SuiteRunnerWorker.run(SuiteRunnerWorker.java:86)
at org.testng.TestNG.runSuitesSequentially(TestNG.java:1222)
at org.testng.TestNG.runSuitesLocally(TestNG.java:1147)
at org.testng.TestNG.runSuites(TestNG.java:1072)
at org.testng.TestNG.run(TestNG.java:1044)
at com.sun.javatest.regtest.agent.TestNGRunner.main(TestNGRunner.java:87)
at com.sun.javatest.regtest.agent.TestNGRunner.main(TestNGRunner.java:54)
at java.base/jdk.internal.reflect.NativeMethodAccessorImpl.invoke0(Native Method)
at java.base/jdk.internal.reflect.NativeMethodAccessorImpl.invoke(NativeMethodAccessorImpl.java:62)
at java.base/jdk.internal.reflect.DelegatingMethodAccessorImpl.invoke(DelegatingMethodAccessorImpl.java:43)
at java.base/java.lang.reflect.Method.invoke(Method.java:538)
at com.sun.javatest.regtest.agent.MainWrapper$MainThread.run(MainWrapper.java:110)
at java.base/java.lang.Thread.run(Thread.java:844)
test tck.java.time.format.TCKDateTimeParseResolver.test_withChronology_noOverride(): success
test tck.java.time.format.TCKDateTimeParseResolver.test_withChronology_override(): success
test tck.java.time.format.TCKDateTimeParseResolver.test_withChronology_parsedChronology_noOverride(): success
test tck.java.time.format.TCKDateTimeParseResolver.test_withChronology_parsedChronology_override(): success
test tck.java.time.format.TCKDateTimeParseResolver.test_withZone_noOverride(): success
test tck.java.time.format.TCKDateTimeParseResolver.test_withZone_override(): success
test tck.java.time.format.TCKDateTimeParseResolver.test_withZone_parsedZone_noOverride(): success
test tck.java.time.format.TCKDateTimeParseResolver.test_withZone_parsedZone_override(): success
===============================================
java/time/tck/java/time/format/TCKDateTimeParseResolver.java
Total tests run: 48, Failures: 19, Skips: 0
===============================================
----------System.err:(14/861)----------
java.lang.Exception: failures: 19
at com.sun.javatest.regtest.agent.TestNGRunner.main(TestNGRunner.java:89)
at com.sun.javatest.regtest.agent.TestNGRunner.main(TestNGRunner.java:54)
at java.base/jdk.internal.reflect.NativeMethodAccessorImpl.invoke0(Native Method)
at java.base/jdk.internal.reflect.NativeMethodAccessorImpl.invoke(NativeMethodAccessorImpl.java:62)
at java.base/jdk.internal.reflect.DelegatingMethodAccessorImpl.invoke(DelegatingMethodAccessorImpl.java:43)
at java.base/java.lang.reflect.Method.invoke(Method.java:538)
at com.sun.javatest.regtest.agent.MainWrapper$MainThread.run(MainWrapper.java:110)
at java.base/java.lang.Thread.run(Thread.java:844)
JavaTest Message: Test threw exception: java.lang.Exception: failures: 19
JavaTest Message: shutting down test
STATUS:Failed.`main' threw exception: java.lang.Exception: failures: 19
----------rerun:(24/2761)*----------
HOME=/var/lib/hudson \\
JTREG_HOME=/var/www/hudson/ws/workspace/MinimalDepsRun/jtreg \\
LANG=en_US.UTF-8 \\
PATH=/bin:/usr/bin \\
CLASSPATH=/var/www/hudson/ws/workspace/MinimalDepsRun/jake/jdk/test/JTwork-java-time-tck-java-time-format-TCKDateTimeParseResolver-java_0/classes/java/time:/var/www/hudson/ws/workspace/MinimalDepsRun/jake/jdk/test/java/time:/var/www/hudson/ws/workspace/MinimalDepsRun/jake/jdk/test/JTwork-java-time-tck-java-time-format-TCKDateTimeParseResolver-java_0/classes/lib/testlibrary:/var/www/hudson/ws/workspace/MinimalDepsRun/jake/jdk/test/lib/testlibrary:/var/www/hudson/ws/workspace/MinimalDepsRun/jtreg/lib/testng.jar:/var/www/hudson/ws/workspace/MinimalDepsRun/jtreg/lib/javatest.jar:/var/www/hudson/ws/workspace/MinimalDepsRun/jtreg/lib/jtreg.jar \\
/var/www/hudson/ws/workspace/MinimalDepsRun/jake/build/linux-x64/images/jdk/bin/java \\
-Dtest.src=/var/www/hudson/ws/workspace/MinimalDepsRun/jake/jdk/test/java/time \\
-Dtest.src.path=/var/www/hudson/ws/workspace/MinimalDepsRun/jake/jdk/test/java/time:/var/www/hudson/ws/workspace/MinimalDepsRun/jake/jdk/test/lib/testlibrary \\
-Dtest.classes=/var/www/hudson/ws/workspace/MinimalDepsRun/jake/jdk/test/JTwork-java-time-tck-java-time-format-TCKDateTimeParseResolver-java_0/classes/java/time \\
-Dtest.class.path=/var/www/hudson/ws/workspace/MinimalDepsRun/jake/jdk/test/JTwork-java-time-tck-java-time-format-TCKDateTimeParseResolver-java_0/classes/java/time:/var/www/hudson/ws/workspace/MinimalDepsRun/jake/jdk/test/JTwork-java-time-tck-java-time-format-TCKDateTimeParseResolver-java_0/classes/lib/testlibrary \\
-Dtest.vm.opts= \\
-Dtest.tool.vm.opts= \\
-Dtest.compiler.opts='--limit-modules java.base' \\
-Dtest.java.opts='--limit-modules java.base' \\
-Dtest.jdk=/var/www/hudson/ws/workspace/MinimalDepsRun/jake/build/linux-x64/images/jdk \\
-Dcompile.jdk=/var/www/hudson/ws/workspace/MinimalDepsRun/jake/build/linux-x64/images/jdk \\
-Dtest.timeout.factor=1.0 \\
-Dtest.modules='java.base/java.time:open java.base/java.time.chrono:open java.base/java.time.zone:open' \\
--add-modules java.base \\
--add-opens java.base/java.time=ALL-UNNAMED \\
--add-opens java.base/java.time.chrono=ALL-UNNAMED \\
--add-opens java.base/java.time.zone=ALL-UNNAMED \\
--limit-modules java.base \\
com.sun.javatest.regtest.agent.MainWrapper /var/www/hudson/ws/workspace/MinimalDepsRun/jake/jdk/test/JTwork-java-time-tck-java-time-format-TCKDateTimeParseResolver-java_0/java/time/tck/java/time/format/TCKDateTimeParseResolver.d/testng.2.jta java/time/tck/java/time/format/TCKDateTimeParseResolver.java tck.java.time.format.TCKDateTimeParseResolver
result: Failed. Execution failed: `main' threw exception: java.lang.Exception: failures: 19
test result: Failed. Execution failed: `main' threw exception: java.lang.Exception: failures: 19
More information about the core-libs-dev
mailing list