[Bug 277] New: zero build with GCC-4.4 ftbfs
bugzilla-daemon at icedtea.classpath.org
bugzilla-daemon at icedtea.classpath.org
Tue Jan 6 16:28:43 PST 2009
http://icedtea.classpath.org/bugzilla/show_bug.cgi?id=277
Summary: zero build with GCC-4.4 ftbfs
Product: IcedTea
Version: unspecified
Platform: PC
OS/Version: Linux
Status: NEW
Severity: normal
Priority: P2
Component: IcedTea
AssignedTo: unassigned at icedtea.classpath.org
ReportedBy: doko at ubuntu.com
seen when building without precompiled headers
g++-4.4 -DLINUX -D_GNU_SOURCE -DCC_INTERP -DZERO -DPARISC
-DZERO_LIBARCH=\"parisc\" -DPRODUCT -I../generated/adfiles
-I../generated/jvmtifiles
-I/home/packages/openjdk/openjdk-6-6b14/openjdk-ecj/hotspot/src/share/vm/asm
-I/home/packages/openjdk/openjdk-6-6b14/openjdk-ecj/hotspot/src/share/vm/c1
-I/home/packages/openjdk/openjdk-6-6b14/openjdk-ecj/hotspot/src/share/vm/ci
-I/home/packages/openjdk/openjdk-6-6b14/openjdk-ecj/hotspot/src/share/vm/classfile
-I/home/packages/openjdk/openjdk-6-6b14/openjdk-ecj/hotspot/src/share/vm/code
-I/home/packages/openjdk/openjdk-6-6b14/openjdk-ecj/hotspot/src/share/vm/compiler
-I/home/packages/openjdk/openjdk-6-6b14/openjdk-ecj/hotspot/src/share/vm/gc_implementation
-I/home/packages/openjdk/openjdk-6-6b14/openjdk-ecj/hotspot/src/share/vm/gc_implementation/concurrentMarkSweep
-I/home/packages/openjdk/openjdk-6-6b14/openjdk-ecj/hotspot/src/share/vm/gc_implementation/g1
-I/home/packages/openjdk/openjdk-6-6b14/openjdk-ecj/hotspot/src/share/vm/gc_implementation/parNew
-I/home/packages/openjdk/openjdk-6-6b14/openjdk-ecj/hotspot/src/share/vm/gc_implementation/parallelScavenge
-I/home/packages/openjdk/openjdk-6-6b14/openjdk-ecj/hotspot/src/share/vm/gc_implementation/shared
-I/home/packages/openjdk/openjdk-6-6b14/openjdk-ecj/hotspot/src/share/vm/gc_interface
-I/home/packages/openjdk/openjdk-6-6b14/openjdk-ecj/hotspot/src/share/vm/interpreter
-I/home/packages/openjdk/openjdk-6-6b14/openjdk-ecj/hotspot/src/share/vm/memory
-I/home/packages/openjdk/openjdk-6-6b14/openjdk-ecj/hotspot/src/share/vm/oops
-I/home/packages/openjdk/openjdk-6-6b14/openjdk-ecj/hotspot/src/share/vm/prims
-I/home/packages/openjdk/openjdk-6-6b14/openjdk-ecj/hotspot/src/share/vm/runtime
-I/home/packages/openjdk/openjdk-6-6b14/openjdk-ecj/hotspot/src/share/vm/services
-I/home/packages/openjdk/openjdk-6-6b14/openjdk-ecj/hotspot/src/share/vm/shark
-I/home/packages/openjdk/openjdk-6-6b14/openjdk-ecj/hotspot/src/share/vm/utilities
-I/home/packages/openjdk/openjdk-6-6b14/openjdk-ecj/hotspot/src/cpu/zero/vm
-I/home/packages/openjdk/openjdk-6-6b14/openjdk-ecj/hotspot/src/os/linux/vm
-I/home/packages/openjdk/openjdk-6-6b14/openjdk-ecj/hotspot/src/os_cpu/linux_zero/vm
-I../generated -DHOTSPOT_RELEASE_VERSION="\"14.0-b08\""
-DHOTSPOT_BUILD_TARGET="\"product\"" -DHOTSPOT_BUILD_USER="\"doko\""
-DHOTSPOT_LIB_ARCH=\"parisc\" -DJRE_RELEASE_VERSION="\"1.6.0_0-b14\""
-DHOTSPOT_VM_DISTRO="\"OpenJDK\"" -fPIC -fno-rtti -fno-exceptions -D_REENTRANT
-fcheck-new -g -pipe -O3 -fno-strict-aliasing -Wpointer-arith -Wsign-compare
-c -o debugInfoRec.o
/home/packages/openjdk/openjdk-6-6b14/openjdk-ecj/hotspot/src/share/vm/code/debugInfoRec.cpp
/home/packages/openjdk/openjdk-6-6b14/openjdk-ecj/hotspot/src/cpu/zero/vm/cppInterpreter_zero.cpp:
In static member function 'static void
CppInterpreter::native_entry(methodOopDesc*, intptr_t, Thread*)':
/home/packages/openjdk/openjdk-6-6b14/openjdk-ecj/hotspot/src/cpu/zero/vm/cppInterpreter_zero.cpp:293:
error: 'ThreadStateTransition' has not been declared
/home/packages/openjdk/openjdk-6-6b14/openjdk-ecj/hotspot/src/cpu/zero/vm/cppInterpreter_zero.cpp:300:
error: 'ThreadStateTransition' has not been declared
make[7]: *** [cppInterpreter_zero.o] Error 1
make[7]: *** Waiting for unfinished jobs....
/home/packages/openjdk/openjdk-6-6b14/openjdk-ecj/hotspot/src/share/vm/utilities/bitMap.hpp:155:
warning: inline function 'void BitMap::set_bit(size_t)' used but never defined
/home/packages/openjdk/openjdk-6-6b14/openjdk-ecj/hotspot/src/share/vm/utilities/bitMap.hpp:155:
warning: inline function 'void BitMap::set_bit(size_t)' used but never defined
make[7]: Leaving directory
`/home/packages/openjdk/openjdk-6-6b14/openjdk-ecj/control/build/linux-parisc/hotspot/outputdir/linux_zero_core/product'
make[6]: *** [the_vm] Error 2
make[6]: Leaving directory
`/home/packages/openjdk/openjdk-6-6b14/openjdk-ecj/control/build/linux-parisc/hotspot/outputdir/linux_zero_core/product'
make[5]: *** [productcore] Error 2
--
Configure bugmail: http://icedtea.classpath.org/bugzilla/userprefs.cgi?tab=email
------- You are receiving this mail because: -------
You are the assignee for the bug, or are watching the assignee.
More information about the distro-pkg-dev
mailing list