The big Zero deletion
Andrew John Hughes
ahughes at redhat.com
Thu Jun 24 13:40:56 PDT 2010
On 24 June 2010 17:19, Matthias Klose <doko at ubuntu.com> wrote:
> On 24.06.2010 17:27, Andrew John Hughes wrote:
>>
>> On 24 June 2010 11:33, Matthias Klose<doko at ubuntu.com> wrote:
>>>
>>> On 24.06.2010 10:51, Xerxes Rånby wrote:
>>>>
>>>>
>>>>
>>>> /home/xerxes/icedtea6-shark-b20/openjdk/hotspot/src/share/vm/runtime/globals.cpp
>>>>
>>>>
>>>>
>>>> /home/xerxes/icedtea6-shark-b20/openjdk/hotspot/src/share/vm/runtime/globals.cpp:34:
>>>> error: 'pd_InlineSmallCode' was not declared in this scope
>>>> make[7]: *** [globals.o] Error 1
>>>
>>> just a me too, didn't find out the reason yet.
>>>
>>
>> At a guess, you need to revert
>> http://icedtea.classpath.org/hg/icedtea6/rev/ae50851aec72
>
> yes, getting a bit further (with llvm-2.7): until
>
> In file included from ../generated/incls/_sharkBlock.cpp.incl:11,
> from
> /scratch/packages/openjdk/b20/openjdk-6-6b20~pre1/build/zerovm/openjdk/hot
> spot/src/share/vm/shark/sharkBlock.cpp:27:
> /scratch/packages/openjdk/b20/openjdk-6-6b20~pre1/build/zerovm/openjdk/hotspot/src/share/vm/shar
> k/sharkBuilder.hpp: In member function 'llvm::Value*
> SharkBuilder::CreateInlineOop(ciObject*, co
> nst char*)':
> /scratch/packages/openjdk/b20/openjdk-6-6b20~pre1/build/zerovm/openjdk/hotspot/src/share/vm/shar
> k/sharkBuilder.hpp:195: error: 'class ciObject' has no member named
> 'encoding'
> In file included from ../generated/incls/_sharkCacheDecache.cpp.incl:10,
> from
> /scratch/packages/openjdk/b20/openjdk-6-6b20~pre1/build/zerovm/openjdk/hot
> spot/src/share/vm/shark/sharkCacheDecache.cpp:27:
> /scratch/packages/openjdk/b20/openjdk-6-6b20~pre1/build/zerovm/openjdk/hotspot/src/share/vm/shar
> k/sharkBuilder.hpp: In member function 'llvm::Value*
> SharkBuilder::CreateInlineOop(ciObject*, co
> nst char*)':
> /scratch/packages/openjdk/b20/openjdk-6-6b20~pre1/build/zerovm/openjdk/hotspot/src/share/vm/shar
> k/sharkBuilder.hpp:195: error: 'class ciObject' has no member named
> 'encoding'In file included f
> rom ../generated/incls/_sharkBuilder.cpp.incl:10,
> from
> /scratch/packages/openjdk/b20/openjdk-6-6b20~pre1/build/zerovm/openjdk/hot
> spot/src/share/vm/shark/sharkBuilder.cpp:27:
> /scratch/packages/openjdk/b20/openjdk-6-6b20~pre1/build/zerovm/openjdk/hotspot/src/share/vm/shark/sharkBuilder.hpp:
> In member function 'llvm::Value* SharkBuilder::CreateInlineOop(ciObject*,
> const char*)':
> /scratch/packages/openjdk/b20/openjdk-6-6b20~pre1/build/zerovm/openjdk/hotspot/src/share/vm/shark/sharkBuilder.hpp:195:
> error: 'class ciObject' has no member named 'encoding'
>
> In file included from ../generated/incls/_sharkCompiler.cpp.incl:11,
> from
> /scratch/packages/openjdk/b20/openjdk-6-6b20~pre1/build/zerovm/openjdk/hotspot/src/share/vm/shark/sharkCompiler.cpp:27:
> /scratch/packages/openjdk/b20/openjdk-6-6b20~pre1/build/zerovm/openjdk/hotspot/src/share/vm/shark/sharkBuilder.hpp:
> In member function 'llvm::Value* SharkBuilder::CreateInlineOop(ciObject*,
> const char*)':
> /scratch/packages/openjdk/b20/openjdk-6-6b20~pre1/build/zerovm/openjdk/hotspot/src/share/vm/shark/sharkBuilder.hpp:195:
> error: 'class ciObject' has no member named 'encoding'
>
This may be what you need:
http://icedtea.classpath.org/hg/shark/hotspot/rev/3236ce90f188
--
Andrew :-)
Free Java Software Engineer
Red Hat, Inc. (http://www.redhat.com)
Support Free Java!
Contribute to GNU Classpath and the OpenJDK
http://www.gnu.org/software/classpath
http://openjdk.java.net
PGP Key: 94EFD9D8 (http://subkeys.pgp.net)
Fingerprint: F8EF F1EA 401E 2E60 15FA 7927 142C 2591 94EF D9D8
More information about the distro-pkg-dev
mailing list