Build failed in Hudson: IcedTea6hgTargetTesting #108

Mark Wielaard mark at klomp.org
Thu Jan 6 03:12:46 PST 2011


Hi Andrew,

On Thu, 2011-01-06 at 02:20 -0500, Hudson Admin wrote:
> [...]
> patching file openjdk/jdk/src/share/classes/com/sun/script/javascript/RhinoCompiledScript.java
> Checking patches/openjdk/6725214-direct3d-01.patch
> 1 out of 2 hunks FAILED -- saving rejects to file openjdk/jdk/make/common/shared/Platform.gmk.rej
> 1 out of 2 hunks FAILED -- saving rejects to file openjdk/jdk/make/sun/xawt/mapfile-vers.rej
> 1 out of 3 hunks FAILED -- saving rejects to file openjdk/jdk/src/share/classes/sun/java2d/SunGraphicsEnvironment.java.rej
> ERROR patch patches/openjdk/6725214-direct3d-01.patch FAILED!
> WARNING make clean-patch before retrying a fix
> make: *** [stamps/patch.stamp] Error 2
> + exit 1

Could you take a look at why this is failing? It seems to have failed in
exactly the same way for a couple of days now, but I haven't seen this
failure on other setups.

Thanks,

Mark




More information about the distro-pkg-dev mailing list