[Bug 1336] [IcedTea6] Bootstrap failure on Fedora 17/18

bugzilla-daemon at icedtea.classpath.org bugzilla-daemon at icedtea.classpath.org
Mon Apr 15 23:19:26 PDT 2013


http://icedtea.classpath.org/bugzilla/show_bug.cgi?id=1336

--- Comment #5 from Stefan Ring <stefan at complang.tuwien.ac.at> ---
One thing that did change, as opposed to bcad714e7c48, at least on Fedora 18:
The build stops at the same point, but the error messages about SSLContext are
gone. It looks like this now, and I have no idea where to go look for compiler
output. There just isn't any:

compile:
    [javac] Compiling 2545 source files to
/home/sr/staging/staging-build/icedtea6/openjdk.build-ecj/jaxws/build/classes

BUILD FAILED
/home/sr/staging/staging-build/icedtea6/openjdk-ecj/jaxws/build.xml:136:
Compile failed; see the compiler error output for details.

Total time: 1 minute 24 seconds
make[4]: *** [all] Error 1
make[4]: Leaving directory
`/home/sr/staging/staging-build/icedtea6/openjdk-ecj/jaxws/make'
make[3]: *** [jaxws-build] Error 2
make[3]: Leaving directory
`/home/sr/staging/staging-build/icedtea6/openjdk-ecj'
make[2]: *** [build_product_image] Error 2
make[2]: Leaving directory
`/home/sr/staging/staging-build/icedtea6/openjdk-ecj'
make[1]: *** [jdk_only] Error 2
make[1]: Leaving directory
`/home/sr/staging/staging-build/icedtea6/openjdk-ecj'
make: *** [stamps/icedtea-ecj.stamp] Error 2

-- 
You are receiving this mail because:
You are on the CC list for the bug.
-------------- next part --------------
An HTML attachment was scrubbed...
URL: http://mail.openjdk.java.net/pipermail/distro-pkg-dev/attachments/20130416/9d10cffa/attachment.html 


More information about the distro-pkg-dev mailing list