[rfc][icedtea-web] rewert of changset 757 "Simplify IcedTeaScriptableJavaObject"
Jiri Vanek
jvanek at redhat.com
Tue Jan 14 07:48:50 PST 2014
Unluckily the regressions caused by (otherwise good)
http://icedtea.classpath.org/hg/icedtea-web/rev/ee92f55c69a3
+2013-06-21 Adam Domurad <adomurad at redhat.com>
+
+ * plugin/icedteanp/IcedTeaScriptablePluginObject.cc: Simplify
+ IcedTeaScriptableJavaObject
+ * plugin/icedteanp/IcedTeaScriptablePluginObject.h: Same
were never successfully fixed, and I gave up on it :(
This is revert of patch in tip. Please note, that this is *manual* revert of patch.
When I did it , i was just 50% sure what I done. But the result of selected set of reproducers have
persuaded me that I did it correctly. (three "r" attachments)
So (any) reviwer, please (and sorry!), be double careful!-)
J.
ps: there is still one patch to go. But I'm still in hunt on it:
1,56d0
< changeset: 744:f22262521491
< tag: tip
< user: Jiri Vanek <jvanek at redhat.com>
< date: Tue Jun 04 17:35:53 2013 +0200
< summary: more detailed hint for CCannotClearCache
<
< changeset: 743:07f37cd6d7bc
< user: Adam Domurad <adomurad at redhat.com>
< date: Tue Jun 04 10:47:19 2013 -0400
< summary: Remove unused IcedTeaRunnable.h & IcedTeaRunnable.cc
<
< changeset: 742:a486f1493133
< user: Adam Domurad <adomurad at redhat.com>
< date: Mon Jun 03 12:25:50 2013 -0400
< summary: Handle resizing plugin message more robustly by not blocking worker thread
<
< changeset: 741:d6f6c5524acc
< user: Adam Domurad <adomurad at redhat.com>
< date: Mon Jun 03 10:51:47 2013 -0400
< summary: Add NativeLibraryStorageTEst
<
< changeset: 740:8e6aa48abeba
< user: Adam Domurad <adomurad at redhat.com>
< date: Mon Jun 03 10:34:36 2013 -0400
< summary: Extract NativeLibraryStorage class from JNLPClassLoader
<
< changeset: 739:2566a700bd86
< user: Adam Domurad <adomurad at redhat.com>
< date: Wed May 29 15:43:21 2013 -0400
< summary: Move inner test class MockedOneJarJNLPFile to top-level DummyJNLPFileWithJar
<
< changeset: 738:acc70a489a2d
< user: Adam Domurad <adomurad at redhat.com>
< date: Wed May 29 10:54:44 2013 -0400
< summary: Remove 'serious' from error message in splash screen.
<
< changeset: 737:9e1f7dc48c20
< user: Jiri Vanek <jvanek at redhat.com>
< date: Mon May 20 16:22:44 2013 +0200
< summary: Synchronized launchers to be from one source
<
< changeset: 736:3dd0ae4efe78
< user: Jiri Vanek <jvanek at redhat.com>
< date: Mon May 20 15:13:32 2013 +0200
< summary: Fixed possible deadlock for applet->js->applet call with testcase
<
< changeset: 735:64f7c169eb3e
< user: Adam Domurad <adomurad at redhat.com>
< date: Fri May 17 12:34:41 2013 -0400
< summary: Reproducer for PR854
<
< changeset: 734:29aad2f10875
< user: Adam Domurad <adomurad at redhat.com>
< date: Fri May 17 12:31:32 2013 -0400
< summary: Fix PR854: Resizing an applet several times causes 100% CPU load
<
57a2
> tag: tip
-------------- next part --------------
A non-text attachment was scrubbed...
Name: r756r757-manualRevert.diff
Type: text/x-patch
Size: 17308 bytes
Desc: not available
Url : http://mail.openjdk.java.net/pipermail/distro-pkg-dev/attachments/20140114/402585d6/r756r757-manualRevert-0001.diff
-------------- next part --------------
Passed: JSToJFuncParamTest.AppletJSToJFuncParam_double_Test - chromium-browser
Passed: JSToJFuncParamTest.AppletJSToJFuncParam_double_Test - opera
Passed: JSToJFuncParamTest.AppletJSToJFuncParam_double_Test - midori
Passed: JSToJFuncParamTest.AppletJSToJFuncParam_double_Test - epiphany
FAILED: AppletJSToJFuncParam_StringIntMixed_Test - chromium-browser(JSToJFuncParamTest) JSToJFuncParam: the output should include: StringIntMixedParam [test, 123], but it didnt.
Passed: JSToJFuncParamTest.AppletJSToJFuncParam_StringIntMixed_Test - opera
FAILED: AppletJSToJFuncParam_StringIntMixed_Test - midori(JSToJFuncParamTest) JSToJFuncParam: the output should include: StringIntMixedParam [test, 123], but it didnt.
FAILED: AppletJSToJFuncParam_StringIntMixed_Test - epiphany(JSToJFuncParamTest) JSToJFuncParam: the output should include: StringIntMixedParam [test, 123], but it didnt.
FAILED: AppletJSToJFuncParam_booleanFalseStr_Test - chromium-browser(JSToJFuncParamTest) JSToJFuncParam: the output should include: booleanParam true, but it didnt.
Passed: JSToJFuncParamTest.AppletJSToJFuncParam_booleanFalseStr_Test - opera
FAILED: AppletJSToJFuncParam_booleanFalseStr_Test - midori(JSToJFuncParamTest) JSToJFuncParam: the output should include: booleanParam true, but it didnt.
FAILED: AppletJSToJFuncParam_booleanFalseStr_Test - epiphany(JSToJFuncParamTest) JSToJFuncParam: the output should include: booleanParam true, but it didnt.
FAILED: AppletJSToJFuncParam_Byte_Test - chromium-browser(JSToJFuncParamTest) JSToJFuncParam: the output should include: ByteParam 10, but it didnt.
Passed: JSToJFuncParamTest.AppletJSToJFuncParam_Byte_Test - opera
FAILED: AppletJSToJFuncParam_Byte_Test - midori(JSToJFuncParamTest) JSToJFuncParam: the output should include: ByteParam 10, but it didnt.
FAILED: AppletJSToJFuncParam_Byte_Test - epiphany(JSToJFuncParamTest) JSToJFuncParam: the output should include: ByteParam 10, but it didnt.
FAILED: AppletJSToJFuncParam_charArray_Test - chromium-browser(JSToJFuncParamTest) JSToJFuncParam: the output should include: charArrayParam [a, b, c], but it didnt.
Passed: JSToJFuncParamTest.AppletJSToJFuncParam_charArray_Test - opera
FAILED: AppletJSToJFuncParam_charArray_Test - midori(JSToJFuncParamTest) JSToJFuncParam: the output should include: charArrayParam [a, b, c], but it didnt.
FAILED: AppletJSToJFuncParam_charArray_Test - epiphany(JSToJFuncParamTest) JSToJFuncParam: the output should include: charArrayParam [a, b, c], but it didnt.
FAILED: AppletJSToJFuncParam_BooleanFalseStr_Test - chromium-browser(JSToJFuncParamTest) JSToJFuncParam: the output should include: BooleanParam true, but it didnt.
Passed: JSToJFuncParamTest.AppletJSToJFuncParam_BooleanFalseStr_Test - opera
FAILED: AppletJSToJFuncParam_BooleanFalseStr_Test - midori(JSToJFuncParamTest) JSToJFuncParam: the output should include: BooleanParam true, but it didnt.
FAILED: AppletJSToJFuncParam_BooleanFalseStr_Test - epiphany(JSToJFuncParamTest) JSToJFuncParam: the output should include: BooleanParam true, but it didnt.
Passed: JSToJFuncParamTest.AppletJSToJFuncParam_long_Test - chromium-browser
Passed: JSToJFuncParamTest.AppletJSToJFuncParam_long_Test - opera
Passed: JSToJFuncParamTest.AppletJSToJFuncParam_long_Test - midori
Passed: JSToJFuncParamTest.AppletJSToJFuncParam_long_Test - epiphany
Passed: JSToJFuncParamTest.AppletJSToJFuncParam_float_Test - chromium-browser
Passed: JSToJFuncParamTest.AppletJSToJFuncParam_float_Test - opera
Passed: JSToJFuncParamTest.AppletJSToJFuncParam_float_Test - midori
Passed: JSToJFuncParamTest.AppletJSToJFuncParam_float_Test - epiphany
FAILED: AppletJSToJFuncParam_DummyObjectArray_Test - chromium-browser(JSToJFuncParamTest) JSToJFuncParam: the output should include: DummyObjectArrayParam [Dummy1, Dummy2], but it didnt.
Passed: JSToJFuncParamTest.AppletJSToJFuncParam_DummyObjectArray_Test - opera
FAILED: AppletJSToJFuncParam_DummyObjectArray_Test - midori(JSToJFuncParamTest) JSToJFuncParam: the output should include: DummyObjectArrayParam [Dummy1, Dummy2], but it didnt.
FAILED: AppletJSToJFuncParam_DummyObjectArray_Test - epiphany(JSToJFuncParamTest) JSToJFuncParam: the output should include: DummyObjectArrayParam [Dummy1, Dummy2], but it didnt.
Passed: JSToJFuncParamTest.AppletJSToJFuncParam_Character_Test - chromium-browser
Passed: JSToJFuncParamTest.AppletJSToJFuncParam_Character_Test - opera
Passed: JSToJFuncParamTest.AppletJSToJFuncParam_Character_Test - midori
Passed: JSToJFuncParamTest.AppletJSToJFuncParam_Character_Test - epiphany
Passed: JSToJFuncParamTest.AppletJSToJFuncParam_Double_Test - chromium-browser
Passed: JSToJFuncParamTest.AppletJSToJFuncParam_Double_Test - opera
Passed: JSToJFuncParamTest.AppletJSToJFuncParam_Double_Test - midori
Passed: JSToJFuncParamTest.AppletJSToJFuncParam_Double_Test - epiphany
Passed: JSToJFuncParamTest.AppletJSToJFuncParam_String_Test - chromium-browser
Passed: JSToJFuncParamTest.AppletJSToJFuncParam_String_Test - opera
Passed: JSToJFuncParamTest.AppletJSToJFuncParam_String_Test - midori
Passed: JSToJFuncParamTest.AppletJSToJFuncParam_String_Test - epiphany
Passed: JSToJFuncParamTest.AppletJSToJFuncParam_char_Test - chromium-browser
Passed: JSToJFuncParamTest.AppletJSToJFuncParam_char_Test - opera
Passed: JSToJFuncParamTest.AppletJSToJFuncParam_char_Test - midori
Passed: JSToJFuncParamTest.AppletJSToJFuncParam_char_Test - epiphany
FAILED: AppletJSToJFuncParam_Long_Test - chromium-browser(JSToJFuncParamTest) JSToJFuncParam: the output should include: LongParam 10000, but it didnt.
Passed: JSToJFuncParamTest.AppletJSToJFuncParam_Long_Test - opera
FAILED: AppletJSToJFuncParam_Long_Test - midori(JSToJFuncParamTest) JSToJFuncParam: the output should include: LongParam 10000, but it didnt.
FAILED: AppletJSToJFuncParam_Long_Test - epiphany(JSToJFuncParamTest) JSToJFuncParam: the output should include: LongParam 10000, but it didnt.
Passed: JSToJFuncParamTest.AppletJSToJFuncParam_boolean_Test - chromium-browser
Passed: JSToJFuncParamTest.AppletJSToJFuncParam_boolean_Test - opera
Passed: JSToJFuncParamTest.AppletJSToJFuncParam_boolean_Test - midori
Passed: JSToJFuncParamTest.AppletJSToJFuncParam_boolean_Test - epiphany
FAILED: AppletJSToJFuncParam_Float_Test - chromium-browser(JSToJFuncParamTest) JSToJFuncParam: the output should include: FloatParam 1.1, but it didnt.
Passed: JSToJFuncParamTest.AppletJSToJFuncParam_Float_Test - opera
FAILED: AppletJSToJFuncParam_Float_Test - midori(JSToJFuncParamTest) JSToJFuncParam: the output should include: FloatParam 1.1, but it didnt.
FAILED: AppletJSToJFuncParam_Float_Test - epiphany(JSToJFuncParamTest) JSToJFuncParam: the output should include: FloatParam 1.1, but it didnt.
Passed: JSToJFuncParamTest.AppletJSToJFuncParam_byte_Test - chromium-browser
Passed: JSToJFuncParamTest.AppletJSToJFuncParam_byte_Test - opera
Passed: JSToJFuncParamTest.AppletJSToJFuncParam_byte_Test - midori
Passed: JSToJFuncParamTest.AppletJSToJFuncParam_byte_Test - epiphany
Passed: JSToJFuncParamTest.AppletJSToJFuncParam_Boolean_Test - chromium-browser
Passed: JSToJFuncParamTest.AppletJSToJFuncParam_Boolean_Test - opera
Passed: JSToJFuncParamTest.AppletJSToJFuncParam_Boolean_Test - midori
Passed: JSToJFuncParamTest.AppletJSToJFuncParam_Boolean_Test - epiphany
FAILED: AppletJSToJFuncParam_Integer_Test - chromium-browser(JSToJFuncParamTest) JSToJFuncParam: the output should include: IntegerParam 1, but it didnt.
Passed: JSToJFuncParamTest.AppletJSToJFuncParam_Integer_Test - opera
FAILED: AppletJSToJFuncParam_Integer_Test - midori(JSToJFuncParamTest) JSToJFuncParam: the output should include: IntegerParam 1, but it didnt.
FAILED: AppletJSToJFuncParam_Integer_Test - epiphany(JSToJFuncParamTest) JSToJFuncParam: the output should include: IntegerParam 1, but it didnt.
Passed: JSToJFuncParamTest.AppletJSToJFuncParam_int_Test - chromium-browser
Passed: JSToJFuncParamTest.AppletJSToJFuncParam_int_Test - opera
Passed: JSToJFuncParamTest.AppletJSToJFuncParam_int_Test - midori
Passed: JSToJFuncParamTest.AppletJSToJFuncParam_int_Test - epiphany
FAILED: AppletJSToJFuncParam_JSObject_Test - chromium-browser(JSToJFuncParamTest) JSToJFuncParam: the output should include: JSObjectParam 100, red, but it didnt.
Passed: JSToJFuncParamTest.AppletJSToJFuncParam_JSObject_Test - opera
FAILED: AppletJSToJFuncParam_JSObject_Test - midori(JSToJFuncParamTest) JSToJFuncParam: the output should include: JSObjectParam 100, red, but it didnt.
FAILED: AppletJSToJFuncParam_JSObject_Test - epiphany(JSToJFuncParamTest) JSToJFuncParam: the output should include: JSObjectParam 100, red, but it didnt.
Total tests run: 84; From those : 0 known to fail
Test known to fail: passed: 0; failed: 0; ignored: 0
Test results: passed: 54; failed: 30; ignored: 0
xsltproc --stringparam logs logs_reproducers.html /home/jvanek/Desktop/icedtea-web/tests/report-styles/jreport.xsl /home/jvanek/Desktop/icedtea-web/tests.build/test-extensions/tests-output.xml > /home/jvanek/Desktop/icedtea-web/tests.build/index_reproducers.html
xsltproc /home/jvanek/Desktop/icedtea-web/tests/report-styles/logs.xsl /home/jvanek/Desktop/icedtea-web/tests.build/test-extensions/ServerAccess-logs.xml > /home/jvanek/Desktop/icedtea-web/tests.build/logs_reproducers.html
xsltproc /home/jvanek/Desktop/icedtea-web/tests/report-styles/textreport.xsl /home/jvanek/Desktop/icedtea-web/tests.build/test-extensions/tests-output.xml > /home/jvanek/Desktop/icedtea-web/tests.build/summary_reproducers.txt
touch stamps/run-netx-dist-tests.stamp
-------------- next part --------------
FAILED: AppletJSToJFuncParam_double_Test - chromium-browser(JSToJFuncParamTest) JSToJFuncParam: the output should include: doubleParam 1.1, but it didnt.
Passed: JSToJFuncParamTest.AppletJSToJFuncParam_double_Test - opera
FAILED: AppletJSToJFuncParam_double_Test - midori(JSToJFuncParamTest) JSToJFuncParam: the output should include: doubleParam 1.1, but it didnt.
FAILED: AppletJSToJFuncParam_double_Test - epiphany(JSToJFuncParamTest) JSToJFuncParam: the output should include: doubleParam 1.1, but it didnt.
FAILED: AppletJSToJFuncParam_StringIntMixed_Test - chromium-browser(JSToJFuncParamTest) JSToJFuncParam: the output should include: StringIntMixedParam [test, 123], but it didnt.
Passed: JSToJFuncParamTest.AppletJSToJFuncParam_StringIntMixed_Test - opera
FAILED: AppletJSToJFuncParam_StringIntMixed_Test - midori(JSToJFuncParamTest) JSToJFuncParam: the output should include: StringIntMixedParam [test, 123], but it didnt.
FAILED: AppletJSToJFuncParam_StringIntMixed_Test - epiphany(JSToJFuncParamTest) JSToJFuncParam: the output should include: StringIntMixedParam [test, 123], but it didnt.
FAILED: AppletJSToJFuncParam_booleanFalseStr_Test - chromium-browser(JSToJFuncParamTest) JSToJFuncParam: the output should include: booleanParam true, but it didnt.
Passed: JSToJFuncParamTest.AppletJSToJFuncParam_booleanFalseStr_Test - opera
FAILED: AppletJSToJFuncParam_booleanFalseStr_Test - midori(JSToJFuncParamTest) JSToJFuncParam: the output should include: booleanParam true, but it didnt.
FAILED: AppletJSToJFuncParam_booleanFalseStr_Test - epiphany(JSToJFuncParamTest) JSToJFuncParam: the output should include: booleanParam true, but it didnt.
FAILED: AppletJSToJFuncParam_Byte_Test - chromium-browser(JSToJFuncParamTest) JSToJFuncParam: the output should include: ByteParam 10, but it didnt.
Passed: JSToJFuncParamTest.AppletJSToJFuncParam_Byte_Test - opera
FAILED: AppletJSToJFuncParam_Byte_Test - midori(JSToJFuncParamTest) JSToJFuncParam: the output should include: ByteParam 10, but it didnt.
FAILED: AppletJSToJFuncParam_Byte_Test - epiphany(JSToJFuncParamTest) JSToJFuncParam: the output should include: ByteParam 10, but it didnt.
FAILED: AppletJSToJFuncParam_charArray_Test - chromium-browser(JSToJFuncParamTest) JSToJFuncParam: the output should include: charArrayParam [a, b, c], but it didnt.
Passed: JSToJFuncParamTest.AppletJSToJFuncParam_charArray_Test - opera
FAILED: AppletJSToJFuncParam_charArray_Test - midori(JSToJFuncParamTest) JSToJFuncParam: the output should include: charArrayParam [a, b, c], but it didnt.
FAILED: AppletJSToJFuncParam_charArray_Test - epiphany(JSToJFuncParamTest) JSToJFuncParam: the output should include: charArrayParam [a, b, c], but it didnt.
FAILED: AppletJSToJFuncParam_BooleanFalseStr_Test - chromium-browser(JSToJFuncParamTest) JSToJFuncParam: the output should include: BooleanParam true, but it didnt.
Passed: JSToJFuncParamTest.AppletJSToJFuncParam_BooleanFalseStr_Test - opera
FAILED: AppletJSToJFuncParam_BooleanFalseStr_Test - midori(JSToJFuncParamTest) JSToJFuncParam: the output should include: BooleanParam true, but it didnt.
FAILED: AppletJSToJFuncParam_BooleanFalseStr_Test - epiphany(JSToJFuncParamTest) JSToJFuncParam: the output should include: BooleanParam true, but it didnt.
FAILED: AppletJSToJFuncParam_long_Test - chromium-browser(JSToJFuncParamTest) JSToJFuncParam: the output should include: longParam 10000, but it didnt.
Passed: JSToJFuncParamTest.AppletJSToJFuncParam_long_Test - opera
FAILED: AppletJSToJFuncParam_long_Test - midori(JSToJFuncParamTest) JSToJFuncParam: the output should include: longParam 10000, but it didnt.
FAILED: AppletJSToJFuncParam_long_Test - epiphany(JSToJFuncParamTest) JSToJFuncParam: the output should include: longParam 10000, but it didnt.
FAILED: AppletJSToJFuncParam_float_Test - chromium-browser(JSToJFuncParamTest) JSToJFuncParam: the output should include: floatParam 1.1, but it didnt.
Passed: JSToJFuncParamTest.AppletJSToJFuncParam_float_Test - opera
FAILED: AppletJSToJFuncParam_float_Test - midori(JSToJFuncParamTest) JSToJFuncParam: the output should include: floatParam 1.1, but it didnt.
FAILED: AppletJSToJFuncParam_float_Test - epiphany(JSToJFuncParamTest) JSToJFuncParam: the output should include: floatParam 1.1, but it didnt.
FAILED: AppletJSToJFuncParam_DummyObjectArray_Test - chromium-browser(JSToJFuncParamTest) JSToJFuncParam: the output should include: DummyObjectArrayParam [Dummy1, Dummy2], but it didnt.
Passed: JSToJFuncParamTest.AppletJSToJFuncParam_DummyObjectArray_Test - opera
FAILED: AppletJSToJFuncParam_DummyObjectArray_Test - midori(JSToJFuncParamTest) JSToJFuncParam: the output should include: DummyObjectArrayParam [Dummy1, Dummy2], but it didnt.
FAILED: AppletJSToJFuncParam_DummyObjectArray_Test - epiphany(JSToJFuncParamTest) JSToJFuncParam: the output should include: DummyObjectArrayParam [Dummy1, Dummy2], but it didnt.
FAILED: AppletJSToJFuncParam_Character_Test - chromium-browser(JSToJFuncParamTest) JSToJFuncParam: the output should include: CharacterParam A, but it didnt.
Passed: JSToJFuncParamTest.AppletJSToJFuncParam_Character_Test - opera
FAILED: AppletJSToJFuncParam_Character_Test - midori(JSToJFuncParamTest) JSToJFuncParam: the output should include: CharacterParam A, but it didnt.
FAILED: AppletJSToJFuncParam_Character_Test - epiphany(JSToJFuncParamTest) JSToJFuncParam: the output should include: CharacterParam A, but it didnt.
FAILED: AppletJSToJFuncParam_Double_Test - chromium-browser(JSToJFuncParamTest) JSToJFuncParam: the output should include: DoubleParam 1.1, but it didnt.
Passed: JSToJFuncParamTest.AppletJSToJFuncParam_Double_Test - opera
FAILED: AppletJSToJFuncParam_Double_Test - midori(JSToJFuncParamTest) JSToJFuncParam: the output should include: DoubleParam 1.1, but it didnt.
FAILED: AppletJSToJFuncParam_Double_Test - epiphany(JSToJFuncParamTest) JSToJFuncParam: the output should include: DoubleParam 1.1, but it didnt.
FAILED: AppletJSToJFuncParam_String_Test - chromium-browser(JSToJFuncParamTest) JSToJFuncParam: the output should include: StringParam test, but it didnt.
Passed: JSToJFuncParamTest.AppletJSToJFuncParam_String_Test - opera
FAILED: AppletJSToJFuncParam_String_Test - midori(JSToJFuncParamTest) JSToJFuncParam: the output should include: StringParam test, but it didnt.
FAILED: AppletJSToJFuncParam_String_Test - epiphany(JSToJFuncParamTest) JSToJFuncParam: the output should include: StringParam test, but it didnt.
FAILED: AppletJSToJFuncParam_char_Test - chromium-browser(JSToJFuncParamTest) JSToJFuncParam: the output should include: charParam a, but it didnt.
Passed: JSToJFuncParamTest.AppletJSToJFuncParam_char_Test - opera
FAILED: AppletJSToJFuncParam_char_Test - midori(JSToJFuncParamTest) JSToJFuncParam: the output should include: charParam a, but it didnt.
FAILED: AppletJSToJFuncParam_char_Test - epiphany(JSToJFuncParamTest) JSToJFuncParam: the output should include: charParam a, but it didnt.
FAILED: AppletJSToJFuncParam_Long_Test - chromium-browser(JSToJFuncParamTest) JSToJFuncParam: the output should include: LongParam 10000, but it didnt.
Passed: JSToJFuncParamTest.AppletJSToJFuncParam_Long_Test - opera
FAILED: AppletJSToJFuncParam_Long_Test - midori(JSToJFuncParamTest) JSToJFuncParam: the output should include: LongParam 10000, but it didnt.
FAILED: AppletJSToJFuncParam_Long_Test - epiphany(JSToJFuncParamTest) JSToJFuncParam: the output should include: LongParam 10000, but it didnt.
FAILED: AppletJSToJFuncParam_boolean_Test - chromium-browser(JSToJFuncParamTest) JSToJFuncParam: the output should include: booleanParam true, but it didnt.
Passed: JSToJFuncParamTest.AppletJSToJFuncParam_boolean_Test - opera
FAILED: AppletJSToJFuncParam_boolean_Test - midori(JSToJFuncParamTest) JSToJFuncParam: the output should include: booleanParam true, but it didnt.
FAILED: AppletJSToJFuncParam_boolean_Test - epiphany(JSToJFuncParamTest) JSToJFuncParam: the output should include: booleanParam true, but it didnt.
FAILED: AppletJSToJFuncParam_Float_Test - chromium-browser(JSToJFuncParamTest) JSToJFuncParam: the output should include: FloatParam 1.1, but it didnt.
Passed: JSToJFuncParamTest.AppletJSToJFuncParam_Float_Test - opera
FAILED: AppletJSToJFuncParam_Float_Test - midori(JSToJFuncParamTest) JSToJFuncParam: the output should include: FloatParam 1.1, but it didnt.
FAILED: AppletJSToJFuncParam_Float_Test - epiphany(JSToJFuncParamTest) JSToJFuncParam: the output should include: FloatParam 1.1, but it didnt.
FAILED: AppletJSToJFuncParam_byte_Test - chromium-browser(JSToJFuncParamTest) JSToJFuncParam: the output should include: byteParam 10, but it didnt.
Passed: JSToJFuncParamTest.AppletJSToJFuncParam_byte_Test - opera
FAILED: AppletJSToJFuncParam_byte_Test - midori(JSToJFuncParamTest) JSToJFuncParam: the output should include: byteParam 10, but it didnt.
FAILED: AppletJSToJFuncParam_byte_Test - epiphany(JSToJFuncParamTest) JSToJFuncParam: the output should include: byteParam 10, but it didnt.
FAILED: AppletJSToJFuncParam_Boolean_Test - chromium-browser(JSToJFuncParamTest) JSToJFuncParam: the output should include: BooleanParam true, but it didnt.
Passed: JSToJFuncParamTest.AppletJSToJFuncParam_Boolean_Test - opera
FAILED: AppletJSToJFuncParam_Boolean_Test - midori(JSToJFuncParamTest) JSToJFuncParam: the output should include: BooleanParam true, but it didnt.
FAILED: AppletJSToJFuncParam_Boolean_Test - epiphany(JSToJFuncParamTest) JSToJFuncParam: the output should include: BooleanParam true, but it didnt.
FAILED: AppletJSToJFuncParam_Integer_Test - chromium-browser(JSToJFuncParamTest) JSToJFuncParam: the output should include: IntegerParam 1, but it didnt.
Passed: JSToJFuncParamTest.AppletJSToJFuncParam_Integer_Test - opera
FAILED: AppletJSToJFuncParam_Integer_Test - midori(JSToJFuncParamTest) JSToJFuncParam: the output should include: IntegerParam 1, but it didnt.
FAILED: AppletJSToJFuncParam_Integer_Test - epiphany(JSToJFuncParamTest) JSToJFuncParam: the output should include: IntegerParam 1, but it didnt.
FAILED: AppletJSToJFuncParam_int_Test - chromium-browser(JSToJFuncParamTest) JSToJFuncParam: the output should include: intParam 1, but it didnt.
Passed: JSToJFuncParamTest.AppletJSToJFuncParam_int_Test - opera
FAILED: AppletJSToJFuncParam_int_Test - midori(JSToJFuncParamTest) JSToJFuncParam: the output should include: intParam 1, but it didnt.
FAILED: AppletJSToJFuncParam_int_Test - epiphany(JSToJFuncParamTest) JSToJFuncParam: the output should include: intParam 1, but it didnt.
FAILED: AppletJSToJFuncParam_JSObject_Test - chromium-browser(JSToJFuncParamTest) JSToJFuncParam: the output should include: JSObjectParam 100, red, but it didnt.
Passed: JSToJFuncParamTest.AppletJSToJFuncParam_JSObject_Test - opera
FAILED: AppletJSToJFuncParam_JSObject_Test - midori(JSToJFuncParamTest) JSToJFuncParam: the output should include: JSObjectParam 100, red, but it didnt.
FAILED: AppletJSToJFuncParam_JSObject_Test - epiphany(JSToJFuncParamTest) JSToJFuncParam: the output should include: JSObjectParam 100, red, but it didnt.
Total tests run: 84; From those : 0 known to fail
Test known to fail: passed: 0; failed: 0; ignored: 0
Test results: passed: 21; failed: 63; ignored: 0
xsltproc --stringparam logs logs_reproducers.html /home/jvanek/Desktop/icedtea-web/tests/report-styles/jreport.xsl /home/jvanek/Desktop/icedtea-web/tests.build/test-extensions/tests-output.xml > /home/jvanek/Desktop/icedtea-web/tests.build/index_reproducers.html
xsltproc /home/jvanek/Desktop/icedtea-web/tests/report-styles/logs.xsl /home/jvanek/Desktop/icedtea-web/tests.build/test-extensions/ServerAccess-logs.xml > /home/jvanek/Desktop/icedtea-web/tests.build/logs_reproducers.html
touch stamps/run-netx-dist-tests.stamp
-------------- next part --------------
Passed: JSToJFuncParamTest.AppletJSToJFuncParam_double_Test - chromium-browser
Passed: JSToJFuncParamTest.AppletJSToJFuncParam_double_Test - opera
Passed: JSToJFuncParamTest.AppletJSToJFuncParam_double_Test - midori
Passed: JSToJFuncParamTest.AppletJSToJFuncParam_double_Test - epiphany
FAILED: AppletJSToJFuncParam_StringIntMixed_Test - chromium-browser(JSToJFuncParamTest) JSToJFuncParam: the output should include: StringIntMixedParam [test, 123], but it didnt.
Passed: JSToJFuncParamTest.AppletJSToJFuncParam_StringIntMixed_Test - opera
FAILED: AppletJSToJFuncParam_StringIntMixed_Test - midori(JSToJFuncParamTest) JSToJFuncParam: the output should include: StringIntMixedParam [test, 123], but it didnt.
FAILED: AppletJSToJFuncParam_StringIntMixed_Test - epiphany(JSToJFuncParamTest) JSToJFuncParam: the output should include: StringIntMixedParam [test, 123], but it didnt.
FAILED: AppletJSToJFuncParam_booleanFalseStr_Test - chromium-browser(JSToJFuncParamTest) JSToJFuncParam: the output should include: booleanParam true, but it didnt.
Passed: JSToJFuncParamTest.AppletJSToJFuncParam_booleanFalseStr_Test - opera
FAILED: AppletJSToJFuncParam_booleanFalseStr_Test - midori(JSToJFuncParamTest) JSToJFuncParam: the output should include: booleanParam true, but it didnt.
FAILED: AppletJSToJFuncParam_booleanFalseStr_Test - epiphany(JSToJFuncParamTest) JSToJFuncParam: the output should include: booleanParam true, but it didnt.
FAILED: AppletJSToJFuncParam_Byte_Test - chromium-browser(JSToJFuncParamTest) JSToJFuncParam: the output should include: ByteParam 10, but it didnt.
Passed: JSToJFuncParamTest.AppletJSToJFuncParam_Byte_Test - opera
FAILED: AppletJSToJFuncParam_Byte_Test - midori(JSToJFuncParamTest) JSToJFuncParam: the output should include: ByteParam 10, but it didnt.
FAILED: AppletJSToJFuncParam_Byte_Test - epiphany(JSToJFuncParamTest) JSToJFuncParam: the output should include: ByteParam 10, but it didnt.
FAILED: AppletJSToJFuncParam_charArray_Test - chromium-browser(JSToJFuncParamTest) JSToJFuncParam: the output should include: charArrayParam [a, b, c], but it didnt.
Passed: JSToJFuncParamTest.AppletJSToJFuncParam_charArray_Test - opera
FAILED: AppletJSToJFuncParam_charArray_Test - midori(JSToJFuncParamTest) JSToJFuncParam: the output should include: charArrayParam [a, b, c], but it didnt.
FAILED: AppletJSToJFuncParam_charArray_Test - epiphany(JSToJFuncParamTest) JSToJFuncParam: the output should include: charArrayParam [a, b, c], but it didnt.
FAILED: AppletJSToJFuncParam_BooleanFalseStr_Test - chromium-browser(JSToJFuncParamTest) JSToJFuncParam: the output should include: BooleanParam true, but it didnt.
Passed: JSToJFuncParamTest.AppletJSToJFuncParam_BooleanFalseStr_Test - opera
FAILED: AppletJSToJFuncParam_BooleanFalseStr_Test - midori(JSToJFuncParamTest) JSToJFuncParam: the output should include: BooleanParam true, but it didnt.
FAILED: AppletJSToJFuncParam_BooleanFalseStr_Test - epiphany(JSToJFuncParamTest) JSToJFuncParam: the output should include: BooleanParam true, but it didnt.
Passed: JSToJFuncParamTest.AppletJSToJFuncParam_long_Test - chromium-browser
Passed: JSToJFuncParamTest.AppletJSToJFuncParam_long_Test - opera
Passed: JSToJFuncParamTest.AppletJSToJFuncParam_long_Test - midori
Passed: JSToJFuncParamTest.AppletJSToJFuncParam_long_Test - epiphany
Passed: JSToJFuncParamTest.AppletJSToJFuncParam_float_Test - chromium-browser
Passed: JSToJFuncParamTest.AppletJSToJFuncParam_float_Test - opera
Passed: JSToJFuncParamTest.AppletJSToJFuncParam_float_Test - midori
Passed: JSToJFuncParamTest.AppletJSToJFuncParam_float_Test - epiphany
FAILED: AppletJSToJFuncParam_DummyObjectArray_Test - chromium-browser(JSToJFuncParamTest) JSToJFuncParam: the output should include: DummyObjectArrayParam [Dummy1, Dummy2], but it didnt.
Passed: JSToJFuncParamTest.AppletJSToJFuncParam_DummyObjectArray_Test - opera
FAILED: AppletJSToJFuncParam_DummyObjectArray_Test - midori(JSToJFuncParamTest) JSToJFuncParam: the output should include: DummyObjectArrayParam [Dummy1, Dummy2], but it didnt.
FAILED: AppletJSToJFuncParam_DummyObjectArray_Test - epiphany(JSToJFuncParamTest) JSToJFuncParam: the output should include: DummyObjectArrayParam [Dummy1, Dummy2], but it didnt.
Passed: JSToJFuncParamTest.AppletJSToJFuncParam_Character_Test - chromium-browser
Passed: JSToJFuncParamTest.AppletJSToJFuncParam_Character_Test - opera
Passed: JSToJFuncParamTest.AppletJSToJFuncParam_Character_Test - midori
Passed: JSToJFuncParamTest.AppletJSToJFuncParam_Character_Test - epiphany
Passed: JSToJFuncParamTest.AppletJSToJFuncParam_Double_Test - chromium-browser
Passed: JSToJFuncParamTest.AppletJSToJFuncParam_Double_Test - opera
Passed: JSToJFuncParamTest.AppletJSToJFuncParam_Double_Test - midori
Passed: JSToJFuncParamTest.AppletJSToJFuncParam_Double_Test - epiphany
Passed: JSToJFuncParamTest.AppletJSToJFuncParam_String_Test - chromium-browser
Passed: JSToJFuncParamTest.AppletJSToJFuncParam_String_Test - opera
Passed: JSToJFuncParamTest.AppletJSToJFuncParam_String_Test - midori
Passed: JSToJFuncParamTest.AppletJSToJFuncParam_String_Test - epiphany
Passed: JSToJFuncParamTest.AppletJSToJFuncParam_char_Test - chromium-browser
Passed: JSToJFuncParamTest.AppletJSToJFuncParam_char_Test - opera
Passed: JSToJFuncParamTest.AppletJSToJFuncParam_char_Test - midori
Passed: JSToJFuncParamTest.AppletJSToJFuncParam_char_Test - epiphany
FAILED: AppletJSToJFuncParam_Long_Test - chromium-browser(JSToJFuncParamTest) JSToJFuncParam: the output should include: LongParam 10000, but it didnt.
Passed: JSToJFuncParamTest.AppletJSToJFuncParam_Long_Test - opera
FAILED: AppletJSToJFuncParam_Long_Test - midori(JSToJFuncParamTest) JSToJFuncParam: the output should include: LongParam 10000, but it didnt.
FAILED: AppletJSToJFuncParam_Long_Test - epiphany(JSToJFuncParamTest) JSToJFuncParam: the output should include: LongParam 10000, but it didnt.
Passed: JSToJFuncParamTest.AppletJSToJFuncParam_boolean_Test - chromium-browser
Passed: JSToJFuncParamTest.AppletJSToJFuncParam_boolean_Test - opera
Passed: JSToJFuncParamTest.AppletJSToJFuncParam_boolean_Test - midori
Passed: JSToJFuncParamTest.AppletJSToJFuncParam_boolean_Test - epiphany
FAILED: AppletJSToJFuncParam_Float_Test - chromium-browser(JSToJFuncParamTest) JSToJFuncParam: the output should include: FloatParam 1.1, but it didnt.
Passed: JSToJFuncParamTest.AppletJSToJFuncParam_Float_Test - opera
FAILED: AppletJSToJFuncParam_Float_Test - midori(JSToJFuncParamTest) JSToJFuncParam: the output should include: FloatParam 1.1, but it didnt.
FAILED: AppletJSToJFuncParam_Float_Test - epiphany(JSToJFuncParamTest) JSToJFuncParam: the output should include: FloatParam 1.1, but it didnt.
Passed: JSToJFuncParamTest.AppletJSToJFuncParam_byte_Test - chromium-browser
Passed: JSToJFuncParamTest.AppletJSToJFuncParam_byte_Test - opera
Passed: JSToJFuncParamTest.AppletJSToJFuncParam_byte_Test - midori
Passed: JSToJFuncParamTest.AppletJSToJFuncParam_byte_Test - epiphany
Passed: JSToJFuncParamTest.AppletJSToJFuncParam_Boolean_Test - chromium-browser
Passed: JSToJFuncParamTest.AppletJSToJFuncParam_Boolean_Test - opera
Passed: JSToJFuncParamTest.AppletJSToJFuncParam_Boolean_Test - midori
Passed: JSToJFuncParamTest.AppletJSToJFuncParam_Boolean_Test - epiphany
FAILED: AppletJSToJFuncParam_Integer_Test - chromium-browser(JSToJFuncParamTest) JSToJFuncParam: the output should include: IntegerParam 1, but it didnt.
Passed: JSToJFuncParamTest.AppletJSToJFuncParam_Integer_Test - opera
FAILED: AppletJSToJFuncParam_Integer_Test - midori(JSToJFuncParamTest) JSToJFuncParam: the output should include: IntegerParam 1, but it didnt.
FAILED: AppletJSToJFuncParam_Integer_Test - epiphany(JSToJFuncParamTest) JSToJFuncParam: the output should include: IntegerParam 1, but it didnt.
Passed: JSToJFuncParamTest.AppletJSToJFuncParam_int_Test - chromium-browser
Passed: JSToJFuncParamTest.AppletJSToJFuncParam_int_Test - opera
Passed: JSToJFuncParamTest.AppletJSToJFuncParam_int_Test - midori
Passed: JSToJFuncParamTest.AppletJSToJFuncParam_int_Test - epiphany
FAILED: AppletJSToJFuncParam_JSObject_Test - chromium-browser(JSToJFuncParamTest) JSToJFuncParam: the output should include: JSObjectParam 100, red, but it didnt.
Passed: JSToJFuncParamTest.AppletJSToJFuncParam_JSObject_Test - opera
FAILED: AppletJSToJFuncParam_JSObject_Test - midori(JSToJFuncParamTest) JSToJFuncParam: the output should include: JSObjectParam 100, red, but it didnt.
FAILED: AppletJSToJFuncParam_JSObject_Test - epiphany(JSToJFuncParamTest) JSToJFuncParam: the output should include: JSObjectParam 100, red, but it didnt.
Total tests run: 84; From those : 0 known to fail
Test known to fail: passed: 0; failed: 0; ignored: 0
Test results: passed: 54; failed: 30; ignored: 0
xsltproc --stringparam logs logs_reproducers.html /home/jvanek/Desktop/icedtea-web/tests/report-styles/jreport.xsl /home/jvanek/Desktop/icedtea-web/tests.build/test-extensions/tests-output.xml > /home/jvanek/Desktop/icedtea-web/tests.build/index_reproducers.html
xsltproc /home/jvanek/Desktop/icedtea-web/tests/report-styles/logs.xsl /home/jvanek/Desktop/icedtea-web/tests.build/test-extensions/ServerAccess-logs.xml > /home/jvanek/Desktop/icedtea-web/tests.build/logs_reproducers.html
touch stamps/run-netx-dist-tests.stamp
More information about the distro-pkg-dev
mailing list