Build failed in Hudson: IcedTea7TargetTesting #860

Hudson Admin ahughes at redhat.com
Wed Jan 18 00:25:29 PST 2012


See <http://toadeater:8080/job/IcedTea7TargetTesting/860/>

------------------------------------------
[...truncated 46336 lines...]
rm -f stamps/versioning.stamp
if [ -e stamps/patch.stamp ] ; then \
  all_patches_ok=yes; \
  for p in patches/rhino.patch     patches/systemtap.patch patches/systemtap-alloc-size-workaround.patch  patches/nss-not-enabled-config.patch  ; \
  do \
    echo Checking $p ; \
    if /usr/bin/patch -l -p0 -R --dry-run -s -t -f < /notnfs/nighttester/icedtea7-target-testing/$p ; \
    then \
      echo Reverting $p ; \
      /usr/bin/patch -l -p0 -R < /notnfs/nighttester/icedtea7-target-testing/$p ; \
    else \
      all_patches_ok=no ; \
    fi ; \
  done ; \
  cd /notnfs/nighttester/icedtea7-target-testing/openjdk/jdk; \
  for p in  ; \
  do \
    echo Checking $p ; \
    if /usr/bin/patch -l -p1 -R --dry-run -s -t -f < /notnfs/nighttester/icedtea7-target-testing/$p ; \
    then \
      echo Reverting $p ; \
      /usr/bin/patch -l -p1 -R < /notnfs/nighttester/icedtea7-target-testing/$p ; \
    else \
      all_patches_ok=no ; \
    fi ; \
  done ; \
  cd /notnfs/nighttester/icedtea7-target-testing ; \
  if ! test x${all_patches_ok} = "xyes" ; then \
    echo "WARNING Not all patches reverted cleanly" ; \
  fi ; \
  rm -f stamps/patch.stamp ; \
fi
Checking patches/rhino.patch
Reverting patches/rhino.patch
patching file openjdk/jdk/make/com/sun/Makefile
patching file openjdk/jdk/make/com/sun/script/Makefile
patching file openjdk/jdk/make/common/Release.gmk
patching file openjdk/jdk/src/share/classes/com/sun/script/javascript/ExternalScriptable.java
patching file openjdk/jdk/src/share/classes/com/sun/script/javascript/JavaAdapter.java
patching file openjdk/jdk/src/share/classes/com/sun/script/javascript/JSAdapter.java
patching file openjdk/jdk/src/share/classes/com/sun/script/javascript/RhinoClassShutter.java
patching file openjdk/jdk/src/share/classes/com/sun/script/javascript/RhinoCompiledScript.java
patching file openjdk/jdk/src/share/classes/com/sun/script/javascript/RhinoScriptEngineFactory.java
patching file openjdk/jdk/src/share/classes/com/sun/script/javascript/RhinoScriptEngine.java
patching file openjdk/jdk/src/share/classes/com/sun/script/javascript/RhinoTopLevel.java
patching file openjdk/jdk/src/share/classes/com/sun/script/javascript/RhinoWrapFactory.java
Checking patches/systemtap.patch
Reverting patches/systemtap.patch
patching file openjdk/hotspot/make/linux/makefiles/dtrace.make
patching file openjdk/hotspot/src/share/vm/prims/jni.cpp
Hunk #1 succeeded at 1833 (offset 16 lines).
Hunk #2 succeeded at 2006 (offset 12 lines).
patching file openjdk/hotspot/src/share/vm/runtime/arguments.cpp
Hunk #1 succeeded at 2574 (offset -60 lines).
patching file openjdk/hotspot/src/share/vm/utilities/dtrace.hpp
Checking patches/systemtap-alloc-size-workaround.patch
Reverting patches/systemtap-alloc-size-workaround.patch
patching file openjdk/hotspot/src/share/vm/runtime/sharedRuntime.cpp
Hunk #1 succeeded at 955 (offset 65 lines).
Checking patches/nss-not-enabled-config.patch
Reverting patches/nss-not-enabled-config.patch
patching file openjdk/jdk/src/share/lib/security/java.security
if [ -e stamps/patch-fsg.stamp ] ; then \
  all_patches_ok=yes; \
  for p in  ; \
  do \
    echo Checking $p ; \
    if /usr/bin/patch -l -p0 -R --dry-run -s -t -f < /notnfs/nighttester/icedtea7-target-testing/$p ; \
    then \
      echo Reverting $p ; \
      /usr/bin/patch -l -p0 -R < /notnfs/nighttester/icedtea7-target-testing/$p ; \
    else \
      all_patches_ok=no ; \
    fi ; \
  done ; \
  if ! test x${all_patches_ok} = "xyes" ; then \
    echo "WARNING Not all patches reverted cleanly" ; \
  fi ; \
  rm -f stamps/patch-fsg.stamp ; \
fi
rm -f stamps/remove-intree-libraries.stamp
rm -f stamps/sanitise-openjdk.stamp
rm -rf openjdk/hotspot
rm -f stamps/extract-hotspot.stamp
rm -rf openjdk
rm -f stamps/extract-openjdk.stamp
rm -rf cacao
rm -f stamps/cacao.stamp
rm -f stamps/extract-cacao.stamp
rm -rf jamvm
rm -f stamps/jamvm.stamp
rm -f stamps/extract-jamvm.stamp
rm -f stamps/extract.stamp
rm -rf /notnfs/nighttester/icedtea7-target-testing/generated.build
rm -f stamps/generated.stamp
rm -f native-ecj
rm -rf stamps/native-ecj.stamp
rm -f stamps/hgforest.stamp
rm -rf /notnfs/nighttester/icedtea7-target-testing/openjdk.build/j2sdk-image/jre/lib/amd64/jamvm
if [ -e /notnfs/nighttester/icedtea7-target-testing/openjdk.build/j2sdk-image/jre/lib/amd64/jvm.cfg ] ; then \
  sed -i 's#-jamvm KNOWN#-jamvm ERROR#' /notnfs/nighttester/icedtea7-target-testing/openjdk.build/j2sdk-image/jre/lib/amd64/jvm.cfg ; \
fi
rm -f stamps/add-jamvm.stamp
rm -f stamps/icedtea-stage2.stamp
rm -rf /notnfs/nighttester/icedtea7-target-testing/openjdk.build-debug/j2sdk-image/jre/lib/amd64/jamvm
if [ -e /notnfs/nighttester/icedtea7-target-testing/openjdk.build-debug/j2sdk-image/jre/lib/amd64/jvm.cfg ] ; then \
  sed -i 's#-jamvm KNOWN#-jamvm ERROR#' /notnfs/nighttester/icedtea7-target-testing/openjdk.build-debug/j2sdk-image/jre/lib/amd64/jvm.cfg ; \
fi
rm -f stamps/add-jamvm-debug.stamp
rm -f stamps/icedtea-debug-stage2.stamp
rm -f stamps/icedtea-stage1.stamp
rm -rf /notnfs/nighttester/icedtea7-target-testing/openjdk.build/j2sdk-image/jre/lib/amd64/zero
rm -rf /notnfs/nighttester/icedtea7-target-testing/openjdk.build/j2sdk-image/jre/lib/amd64/shark
rm -rf zerovm
if [ -e /notnfs/nighttester/icedtea7-target-testing/openjdk.build/j2sdk-image/jre/lib/amd64/jvm.cfg ] ; then \
  sed -i 's#-zero KNOWN#-zero ERROR#' /notnfs/nighttester/icedtea7-target-testing/openjdk.build/j2sdk-image/jre/lib/amd64/jvm.cfg ; \
  sed -i 's#-shark KNOWN#-shark ERROR#' /notnfs/nighttester/icedtea7-target-testing/openjdk.build/j2sdk-image/jre/lib/amd64/jvm.cfg ; \
fi
rm -f stamps/add-zero.stamp
rm -rf /notnfs/nighttester/icedtea7-target-testing/openjdk.build-debug/j2sdk-image/jre/lib/amd64/zero
rm -rf /notnfs/nighttester/icedtea7-target-testing/openjdk.build-debug/j2sdk-image/jre/lib/amd64/shark
rm -rf zerovm
if [ -e /notnfs/nighttester/icedtea7-target-testing/openjdk.build-debug/j2sdk-image/jre/lib/amd64/jvm.cfg ] ; then \
  sed -i 's#-zero KNOWN#-zero ERROR#' /notnfs/nighttester/icedtea7-target-testing/openjdk.build-debug/j2sdk-image/jre/lib/amd64/jvm.cfg ; \
  sed -i 's#-shark KNOWN#-shark ERROR#' /notnfs/nighttester/icedtea7-target-testing/openjdk.build-debug/j2sdk-image/jre/lib/amd64/jvm.cfg ; \
fi
rm -f stamps/add-zero-debug.stamp
rm -rf /notnfs/nighttester/icedtea7-target-testing/openjdk.build/j2sdk-image/jre/lib/amd64/cacao
if [ -e /notnfs/nighttester/icedtea7-target-testing/openjdk.build/j2sdk-image/jre/lib/amd64/jvm.cfg ] ; then \
  sed -i 's#-cacao KNOWN#-cacao ERROR#' /notnfs/nighttester/icedtea7-target-testing/openjdk.build/j2sdk-image/jre/lib/amd64/jvm.cfg ; \
fi
rm -f stamps/add-cacao.stamp
rm -rf /notnfs/nighttester/icedtea7-target-testing/openjdk.build-debug/j2sdk-image/jre/lib/amd64/cacao
if [ -e /notnfs/nighttester/icedtea7-target-testing/openjdk.build-debug/j2sdk-image/jre/lib/amd64/jvm.cfg ] ; then \
  sed -i 's#-cacao KNOWN#-cacao ERROR#' /notnfs/nighttester/icedtea7-target-testing/openjdk.build-debug/j2sdk-image/jre/lib/amd64/jvm.cfg ; \
fi
rm -f stamps/add-cacao-debug.stamp
rm -rf lib/rt
rm -f stamps/rt-class-files.stamp stamps/rt.stamp
rm -f rt-source-files.txt
if [ -e /notnfs/nighttester/icedtea7-target-testing/bootstrap/boot/jre/lib ] ; then \
  cp /usr/lib/jvm/java-gcj/jre/lib/rt.jar /notnfs/nighttester/icedtea7-target-testing/bootstrap/boot/jre/lib ; \
fi
rm -rf rhino/rhino.old
rm -rf rhino/rhino.new
rm -f rhino/rhino.jar
if [ -e rhino ] ; then \
  rmdir rhino ; \
fi
rm -f stamps/rewrite-rhino.stamp
rm -rf /notnfs/nighttester/icedtea7-target-testing/rewriter.build
rm -f stamps/rewriter.stamp
if [ -e bootstrap ]; then \
  rmdir bootstrap ; \
fi
if [ -e lib ]; then \
  rmdir lib ; \
fi
+ make download
mkdir -p stamps 
touch stamps/hgforest.stamp
ln -sf /notnfs/nighttester/drops/icedtea7/openjdk.tar.gz openjdk.tar.gz
if ! echo "aa3b3cf17081cde2a4014e5dffec75f5b5402ad48f7f9943c32a2fa4544a8746  openjdk.tar.gz" \
  | /usr/bin/sha256sum --check ; \
then \
  if [ -e openjdk.tar.gz ] ; \
  then \
    mv openjdk.tar.gz openjdk.tar.gz.old ; \
  fi ; \
  /usr/bin/wget http://icedtea.classpath.org/hg/icedtea7-forest/archive/0a76e5390e68.tar.gz -O openjdk.tar.gz; \
  if ! echo "aa3b3cf17081cde2a4014e5dffec75f5b5402ad48f7f9943c32a2fa4544a8746  openjdk.tar.gz" \
    | /usr/bin/sha256sum --check ; \
  then echo "ERROR: Bad download of OpenJDK root zip"; false; \
  fi; \
fi ;
openjdk.tar.gz: FAILED
/usr/bin/sha256sum: WARNING: 1 of 1 computed checksum did NOT match
--2012-01-18 03:24:54--  http://icedtea.classpath.org/hg/icedtea7-forest/archive/0a76e5390e68.tar.gz
Resolving icedtea.classpath.org... 208.78.240.231
Connecting to icedtea.classpath.org|208.78.240.231|:80... connected.
HTTP request sent, awaiting response... 200 Script output follows
Length: unspecified [application/x-gzip]
Saving to: “openjdk.tar.gz”

     0K .......... .......... .......... .......... .......... 83.0K
    50K .......... .......... .......... .......... ..........  282K
   100K .......... .......... .....                             356K=0.9s

2012-01-18 03:24:56 (147 KB/s) - “openjdk.tar.gz” saved [128534]

openjdk.tar.gz: OK
ln -sf /notnfs/nighttester/drops/icedtea7/corba.tar.gz corba.tar.gz
if ! echo "9579b9f47c45d4e6f4eb080a7a27886163691a77c193d83423389cb87656aec5  corba.tar.gz" \
  | /usr/bin/sha256sum --check ; \
then \
  if [ corba.tar.gz ] ; \
  then \
    mv corba.tar.gz corba.tar.gz.old ; \
  fi ; \
  /usr/bin/wget http://icedtea.classpath.org/hg/icedtea7-forest/corba/archive/4d9e4fb8af09.tar.gz -O corba.tar.gz; \
  if ! echo "9579b9f47c45d4e6f4eb080a7a27886163691a77c193d83423389cb87656aec5  corba.tar.gz" \
    | /usr/bin/sha256sum --check ; \
  then echo "ERROR: Bad download of CORBA zip"; false; \
  fi; \
fi ;
corba.tar.gz: FAILED
/usr/bin/sha256sum: WARNING: 1 of 1 computed checksum did NOT match
--2012-01-18 03:24:56--  http://icedtea.classpath.org/hg/icedtea7-forest/corba/archive/4d9e4fb8af09.tar.gz
Resolving icedtea.classpath.org... 208.78.240.231
Connecting to icedtea.classpath.org|208.78.240.231|:80... connected.
HTTP request sent, awaiting response... 200 Script output follows
Length: unspecified [application/x-gzip]
Saving to: “corba.tar.gz”

     0K .......... .......... .......... .......... .......... 95.6K
    50K .......... .......... .......... .......... ..........  282K
   100K .......... .......... .......... .......... ..........  327K
   150K .......... .......... .......... .......... ..........  315K
   200K .......... .......... .......... .......... ..........  301K
   250K .......... .......... .......... .......... ..........  273K
   300K .......... .......... .......... .......... ..........  282K
   350K .......... .......... .......... .......... ..........  258K
   400K .......... .......... .......... .......... ..........  315K
   450K .......... .......... .......... .......... ..........  256K
   500K .......... .......... .......... .......... ..........  275K
   550K .......... .......... .......... .......... ..........  305K
   600K .......... .......... .......... .......... ..........  295K
   650K .......... .......... .......... .......... ..........  304K
   700K .......... .......... .......... .......... ..........  229K
   750K .......... .......... .......... .......... ..........  270K
   800K .......... .......... .......... .......... ..........  272K
   850K .......... .......... .......... .......... ..........  245K
   900K .......... .......... .......... .......... ..........  304K
   950K .......... .......... .......... .......... ..........  226K
  1000K .....                                                  1.12M=3.9s

2012-01-18 03:25:27 (255 KB/s) - Read error at byte 1029310 (Connection reset by peer).Retrying.

--2012-01-18 03:25:28--  (try: 2)  http://icedtea.classpath.org/hg/icedtea7-forest/corba/archive/4d9e4fb8af09.tar.gz
Connecting to icedtea.classpath.org|208.78.240.231|:80... connected.
HTTP request sent, awaiting response... 200 Script output follows

    The file is already fully retrieved; nothing to do.

corba.tar.gz: FAILED
/usr/bin/sha256sum: WARNING: 1 of 1 computed checksum did NOT match
ERROR: Bad download of CORBA zip
make: *** [stamps/download-openjdk.stamp] Error 1
+ exit 1



More information about the icedtea-test mailing list