Build failed in Jenkins: IcedTea7TargetTesting #1106

Hudson Admin ahughes at redhat.com
Thu Oct 4 03:58:00 PDT 2012


See <http://toadeater.yyz.redhat.com:8080/job/IcedTea7TargetTesting/1106/>

------------------------------------------
[...truncated 40476 lines...]
make[8]: Entering directory `/notnfs/nighttester/icedtea7-target-testing/openjdk-boot/jdk/make/com/sun/java/pack'
/usr/bin/g++  -O2 -DPRODUCT -fPIC -DCC_NOEX -W -Wall  -Wno-unused -Wno-parentheses -fno-omit-frame-pointer -D_LITTLE_ENDIAN -g -DFULL -DNO_ZLIB -DUNPACK_JNI  -DNDEBUG -DARCH='"amd64"' -Damd64 -DLINUX -DRELEASE='"1.7.0_10"' -D_LARGEFILE64_SOURCE -D_GNU_SOURCE -D_REENTRANT -D_LP64=1 -I. -I/notnfs/nighttester/icedtea7-target-testing/openjdk.build-boot/tmp/sun/com.sun.java.util.jar.pack/unpack/CClassHeaders -I../../../../../src/solaris/javavm/export -I../../../../../src/share/javavm/export -I../../../../../src/share/native/common -I../../../../../src/solaris/native/common -I../../../../../src/share/native/com/sun/java/util/jar/pack -I../../../../../src/solaris/native/com/sun/java/util/jar/pack    -c -o /notnfs/nighttester/icedtea7-target-testing/openjdk.build-boot/tmp/sun/com.sun.java.util.jar.pack/unpack/obj64/bands.o  ../../../../../src/share/native/com/sun/java/util/jar/pack/bands.cpp
/usr/bin/g++  -O2 -DPRODUCT -fPIC -DCC_NOEX -W -Wall  -Wno-unused -Wno-parentheses -fno-omit-frame-pointer -D_LITTLE_ENDIAN -g -DFULL -DNO_ZLIB -DUNPACK_JNI  -DNDEBUG -DARCH='"amd64"' -Damd64 -DLINUX -DRELEASE='"1.7.0_10"' -D_LARGEFILE64_SOURCE -D_GNU_SOURCE -D_REENTRANT -D_LP64=1 -I. -I/notnfs/nighttester/icedtea7-target-testing/openjdk.build-boot/tmp/sun/com.sun.java.util.jar.pack/unpack/CClassHeaders -I../../../../../src/solaris/javavm/export -I../../../../../src/share/javavm/export -I../../../../../src/share/native/common -I../../../../../src/solaris/native/common -I../../../../../src/share/native/com/sun/java/util/jar/pack -I../../../../../src/solaris/native/com/sun/java/util/jar/pack    -c -o /notnfs/nighttester/icedtea7-target-testing/openjdk.build-boot/tmp/sun/com.sun.java.util.jar.pack/unpack/obj64/bytes.o  ../../../../../src/share/native/com/sun/java/util/jar/pack/bytes.cpp
/usr/bin/g++  -O2 -DPRODUCT -fPIC -DCC_NOEX -W -Wall  -Wno-unused -Wno-parentheses -fno-omit-frame-pointer -D_LITTLE_ENDIAN -g -DFULL -DNO_ZLIB -DUNPACK_JNI  -DNDEBUG -DARCH='"amd64"' -Damd64 -DLINUX -DRELEASE='"1.7.0_10"' -D_LARGEFILE64_SOURCE -D_GNU_SOURCE -D_REENTRANT -D_LP64=1 -I. -I/notnfs/nighttester/icedtea7-target-testing/openjdk.build-boot/tmp/sun/com.sun.java.util.jar.pack/unpack/CClassHeaders -I../../../../../src/solaris/javavm/export -I../../../../../src/share/javavm/export -I../../../../../src/share/native/common -I../../../../../src/solaris/native/common -I../../../../../src/share/native/com/sun/java/util/jar/pack -I../../../../../src/solaris/native/com/sun/java/util/jar/pack    -c -o /notnfs/nighttester/icedtea7-target-testing/openjdk.build-boot/tmp/sun/com.sun.java.util.jar.pack/unpack/obj64/coding.o  ../../../../../src/share/native/com/sun/java/util/jar/pack/coding.cpp
/usr/bin/g++  -O2 -DPRODUCT -fPIC -DCC_NOEX -W -Wall  -Wno-unused -Wno-parentheses -fno-omit-frame-pointer -D_LITTLE_ENDIAN -g -DFULL -DNO_ZLIB -DUNPACK_JNI  -DNDEBUG -DARCH='"amd64"' -Damd64 -DLINUX -DRELEASE='"1.7.0_10"' -D_LARGEFILE64_SOURCE -D_GNU_SOURCE -D_REENTRANT -D_LP64=1 -I. -I/notnfs/nighttester/icedtea7-target-testing/openjdk.build-boot/tmp/sun/com.sun.java.util.jar.pack/unpack/CClassHeaders -I../../../../../src/solaris/javavm/export -I../../../../../src/share/javavm/export -I../../../../../src/share/native/common -I../../../../../src/solaris/native/common -I../../../../../src/share/native/com/sun/java/util/jar/pack -I../../../../../src/solaris/native/com/sun/java/util/jar/pack    -c -o /notnfs/nighttester/icedtea7-target-testing/openjdk.build-boot/tmp/sun/com.sun.java.util.jar.pack/unpack/obj64/jni.o  ../../../../../src/share/native/com/sun/java/util/jar/pack/jni.cpp
/usr/bin/g++  -O2 -DPRODUCT -fPIC -DCC_NOEX -W -Wall  -Wno-unused -Wno-parentheses -fno-omit-frame-pointer -D_LITTLE_ENDIAN -g -DFULL -DNO_ZLIB -DUNPACK_JNI  -DNDEBUG -DARCH='"amd64"' -Damd64 -DLINUX -DRELEASE='"1.7.0_10"' -D_LARGEFILE64_SOURCE -D_GNU_SOURCE -D_REENTRANT -D_LP64=1 -I. -I/notnfs/nighttester/icedtea7-target-testing/openjdk.build-boot/tmp/sun/com.sun.java.util.jar.pack/unpack/CClassHeaders -I../../../../../src/solaris/javavm/export -I../../../../../src/share/javavm/export -I../../../../../src/share/native/common -I../../../../../src/solaris/native/common -I../../../../../src/share/native/com/sun/java/util/jar/pack -I../../../../../src/solaris/native/com/sun/java/util/jar/pack    -c -o /notnfs/nighttester/icedtea7-target-testing/openjdk.build-boot/tmp/sun/com.sun.java.util.jar.pack/unpack/obj64/unpack.o  ../../../../../src/share/native/com/sun/java/util/jar/pack/unpack.cpp
../../../../../src/share/native/com/sun/java/util/jar/pack/unpack.cpp: In member function 'void unpacker::read_file_header()':
../../../../../src/share/native/com/sun/java/util/jar/pack/unpack.cpp:692:24: warning: comparison between signed and unsigned integer expressions [-Wsign-compare]
/usr/bin/g++  -O2 -DPRODUCT -fPIC -DCC_NOEX -W -Wall  -Wno-unused -Wno-parentheses -fno-omit-frame-pointer -D_LITTLE_ENDIAN -g -DFULL -DNO_ZLIB -DUNPACK_JNI  -DNDEBUG -DARCH='"amd64"' -Damd64 -DLINUX -DRELEASE='"1.7.0_10"' -D_LARGEFILE64_SOURCE -D_GNU_SOURCE -D_REENTRANT -D_LP64=1 -I. -I/notnfs/nighttester/icedtea7-target-testing/openjdk.build-boot/tmp/sun/com.sun.java.util.jar.pack/unpack/CClassHeaders -I../../../../../src/solaris/javavm/export -I../../../../../src/share/javavm/export -I../../../../../src/share/native/common -I../../../../../src/solaris/native/common -I../../../../../src/share/native/com/sun/java/util/jar/pack -I../../../../../src/solaris/native/com/sun/java/util/jar/pack    -c -o /notnfs/nighttester/icedtea7-target-testing/openjdk.build-boot/tmp/sun/com.sun.java.util.jar.pack/unpack/obj64/utils.o  ../../../../../src/share/native/com/sun/java/util/jar/pack/utils.cpp
/usr/bin/g++  -O2 -DPRODUCT -fPIC -DCC_NOEX -W -Wall  -Wno-unused -Wno-parentheses -fno-omit-frame-pointer -D_LITTLE_ENDIAN -g -DFULL -DNO_ZLIB -DUNPACK_JNI  -DNDEBUG -DARCH='"amd64"' -Damd64 -DLINUX -DRELEASE='"1.7.0_10"' -D_LARGEFILE64_SOURCE -D_GNU_SOURCE -D_REENTRANT -D_LP64=1 -I. -I/notnfs/nighttester/icedtea7-target-testing/openjdk.build-boot/tmp/sun/com.sun.java.util.jar.pack/unpack/CClassHeaders -I../../../../../src/solaris/javavm/export -I../../../../../src/share/javavm/export -I../../../../../src/share/native/common -I../../../../../src/solaris/native/common -I../../../../../src/share/native/com/sun/java/util/jar/pack -I../../../../../src/solaris/native/com/sun/java/util/jar/pack    -c -o /notnfs/nighttester/icedtea7-target-testing/openjdk.build-boot/tmp/sun/com.sun.java.util.jar.pack/unpack/obj64/zip.o  ../../../../../src/share/native/com/sun/java/util/jar/pack/zip.cpp
make[8]: Leaving directory `/notnfs/nighttester/icedtea7-target-testing/openjdk-boot/jdk/make/com/sun/java/pack'
Done with parallel compiles: /notnfs/nighttester/icedtea7-target-testing/openjdk-boot/jdk/make/com/sun/java/pack
STATS: LIBRARY=unpack, PRODUCT=sun, OPTIMIZATION_LEVEL=LOWER
Rebuilding /notnfs/nighttester/icedtea7-target-testing/openjdk.build-boot/lib/amd64/libunpack.so because of /notnfs/nighttester/icedtea7-target-testing/openjdk.build-boot/tmp/sun/com.sun.java.util.jar.pack/unpack/obj64/.files_compiled mapfile-vers
/usr/bin/g++  -O2 -DPRODUCT -fPIC -DCC_NOEX -W -Wall  -Wno-unused -Wno-parentheses -fno-omit-frame-pointer -D_LITTLE_ENDIAN -g -DFULL -DNO_ZLIB -DUNPACK_JNI  -DNDEBUG -DARCH='"amd64"' -Damd64 -DLINUX -DRELEASE='"1.7.0_10"' -D_LARGEFILE64_SOURCE -D_GNU_SOURCE -D_REENTRANT -D_LP64=1 -I. -I/notnfs/nighttester/icedtea7-target-testing/openjdk.build-boot/tmp/sun/com.sun.java.util.jar.pack/unpack/CClassHeaders -I../../../../../src/solaris/javavm/export -I../../../../../src/share/javavm/export -I../../../../../src/share/native/common -I../../../../../src/solaris/native/common -I../../../../../src/share/native/com/sun/java/util/jar/pack -I../../../../../src/solaris/native/com/sun/java/util/jar/pack   -Xlinker -O1 -Xlinker -version-script=mapfile-vers  -Wl,--hash-style=both -Xlinker -z -Xlinker origin  -Xlinker -rpath -Xlinker \$ORIGIN  -Xlinker -z -Xlinker defs -L/notnfs/nighttester/icedtea7-target-testing/openjdk.build-boot/lib/amd64 -Wl,-soname=libunpack.so   -shared -o /notnfs/nighttester/icedtea7-target-testing/openjdk.build-boot/lib/amd64/libunpack.so    /notnfs/nighttester/icedtea7-target-testing/openjdk.build-boot/tmp/sun/com.sun.java.util.jar.pack/unpack/obj64/bands.o  /notnfs/nighttester/icedtea7-target-testing/openjdk.build-boot/tmp/sun/com.sun.java.util.jar.pack/unpack/obj64/bytes.o  /notnfs/nighttester/icedtea7-target-testing/openjdk.build-boot/tmp/sun/com.sun.java.util.jar.pack/unpack/obj64/coding.o  /notnfs/nighttester/icedtea7-target-testing/openjdk.build-boot/tmp/sun/com.sun.java.util.jar.pack/unpack/obj64/jni.o  /notnfs/nighttester/icedtea7-target-testing/openjdk.build-boot/tmp/sun/com.sun.java.util.jar.pack/unpack/obj64/unpack.o  /notnfs/nighttester/icedtea7-target-testing/openjdk.build-boot/tmp/sun/com.sun.java.util.jar.pack/unpack/obj64/utils.o  /notnfs/nighttester/icedtea7-target-testing/openjdk.build-boot/tmp/sun/com.sun.java.util.jar.pack/unpack/obj64/zip.o -L/notnfs/nighttester/icedtea7-target-testing/openjdk.build-boot/lib/amd64/server -ljvm -lc -lstdc++  -ljava -L/notnfs/nighttester/icedtea7-target-testing/openjdk.build-boot/lib/amd64/server -ljvm -lc
Checking for mapfile use in: /notnfs/nighttester/icedtea7-target-testing/openjdk.build-boot/lib/amd64/libunpack.so
Library loads for: /notnfs/nighttester/icedtea7-target-testing/openjdk.build-boot/lib/amd64/libunpack.so
	linux-vdso.so.1 =>  (0x00007fffd3155000)
	libjvm.so => not found
	libstdc++.so.6 => /usr/lib64/libstdc++.so.6 (0x00007fa53cca0000)
	libjava.so => /notnfs/nighttester/icedtea7-target-testing/openjdk.build-boot/lib/amd64/libjava.so (0x00007fa53ca76000)
	libc.so.6 => /lib64/libc.so.6 (0x00007fa53c6be000)
	libm.so.6 => /lib64/libm.so.6 (0x00007fa53c439000)
	libgcc_s.so.1 => /lib64/libgcc_s.so.1 (0x00007fa53c224000)
	/lib64/ld-linux-x86-64.so.2 (0x00000039b3000000)
	libjvm.so => not found
	libverify.so => /notnfs/nighttester/icedtea7-target-testing/openjdk.build-boot/lib/amd64/libverify.so (0x00007fa53c015000)
	libdl.so.2 => /lib64/libdl.so.2 (0x00007fa53be11000)
	libjvm.so => not found
RUNPATH for: /notnfs/nighttester/icedtea7-target-testing/openjdk.build-boot/lib/amd64/libunpack.so
 0x0000000000000001 (NEEDED)             Shared library: [libjvm.so]
 0x0000000000000001 (NEEDED)             Shared library: [libstdc++.so.6]
 0x0000000000000001 (NEEDED)             Shared library: [libjava.so]
 0x0000000000000001 (NEEDED)             Shared library: [libc.so.6]
 0x0000000000000001 (NEEDED)             Shared library: [libm.so.6]
 0x0000000000000001 (NEEDED)             Shared library: [libgcc_s.so.1]
 0x000000000000000f (RPATH)              Library rpath: [$ORIGIN]
/usr/bin/make /notnfs/nighttester/icedtea7-target-testing/openjdk.build-boot/bin/unpack200 STANDALONE=true LDMAPFLAGS_DBG=
INFO: ENABLE_FULL_DEBUG_SYMBOLS=1
INFO: /usr/bin/objcopy cmd found so will create .debuginfo files.
INFO: STRIP_POLICY=no_strip
INFO: ZIP_DEBUGINFO_FILES=1
make[8]: Entering directory `/notnfs/nighttester/icedtea7-target-testing/openjdk-boot/jdk/make/com/sun/java/pack'
/bin/mkdir -p /notnfs/nighttester/icedtea7-target-testing/openjdk.build-boot/tmp/sun/com.sun.java.util.jar.pack/unpack-cmd/obj64
rm -f /notnfs/nighttester/icedtea7-target-testing/openjdk.build-boot/tmp/sun/com.sun.java.util.jar.pack/unpack-cmd/obj64/bands.o
/usr/bin/g++  -O2 -DPRODUCT -fPIC -DCC_NOEX -W -Wall  -Wno-unused -Wno-parentheses -fno-omit-frame-pointer -D_LITTLE_ENDIAN -g -DFULL  -DUSE_SYSTEM_ZLIB=1  -DNDEBUG -DARCH='"amd64"' -Damd64 -DLINUX -DRELEASE='"1.7.0_10"' -D_LARGEFILE64_SOURCE -D_GNU_SOURCE -D_REENTRANT -D_LP64=1 -I. -I/notnfs/nighttester/icedtea7-target-testing/openjdk.build-boot/tmp/sun/com.sun.java.util.jar.pack/unpack/CClassHeaders -I../../../../../src/solaris/javavm/export -I../../../../../src/share/javavm/export -I../../../../../src/share/native/common -I../../../../../src/solaris/native/common -I../../../../../src/share/native/com/sun/java/util/jar/pack -I../../../../../src/solaris/native/com/sun/java/util/jar/pack    -c -o /notnfs/nighttester/icedtea7-target-testing/openjdk.build-boot/tmp/sun/com.sun.java.util.jar.pack/unpack-cmd/obj64/bands.o ../../../../../src/share/native/com/sun/java/util/jar/pack/bands.cpp
/bin/mkdir -p /notnfs/nighttester/icedtea7-target-testing/openjdk.build-boot/tmp/sun/com.sun.java.util.jar.pack/unpack-cmd/obj64
rm -f /notnfs/nighttester/icedtea7-target-testing/openjdk.build-boot/tmp/sun/com.sun.java.util.jar.pack/unpack-cmd/obj64/bytes.o
/usr/bin/g++  -O2 -DPRODUCT -fPIC -DCC_NOEX -W -Wall  -Wno-unused -Wno-parentheses -fno-omit-frame-pointer -D_LITTLE_ENDIAN -g -DFULL  -DUSE_SYSTEM_ZLIB=1  -DNDEBUG -DARCH='"amd64"' -Damd64 -DLINUX -DRELEASE='"1.7.0_10"' -D_LARGEFILE64_SOURCE -D_GNU_SOURCE -D_REENTRANT -D_LP64=1 -I. -I/notnfs/nighttester/icedtea7-target-testing/openjdk.build-boot/tmp/sun/com.sun.java.util.jar.pack/unpack/CClassHeaders -I../../../../../src/solaris/javavm/export -I../../../../../src/share/javavm/export -I../../../../../src/share/native/common -I../../../../../src/solaris/native/common -I../../../../../src/share/native/com/sun/java/util/jar/pack -I../../../../../src/solaris/native/com/sun/java/util/jar/pack    -c -o /notnfs/nighttester/icedtea7-target-testing/openjdk.build-boot/tmp/sun/com.sun.java.util.jar.pack/unpack-cmd/obj64/bytes.o ../../../../../src/share/native/com/sun/java/util/jar/pack/bytes.cpp
/bin/mkdir -p /notnfs/nighttester/icedtea7-target-testing/openjdk.build-boot/tmp/sun/com.sun.java.util.jar.pack/unpack-cmd/obj64
rm -f /notnfs/nighttester/icedtea7-target-testing/openjdk.build-boot/tmp/sun/com.sun.java.util.jar.pack/unpack-cmd/obj64/coding.o
/usr/bin/g++  -O2 -DPRODUCT -fPIC -DCC_NOEX -W -Wall  -Wno-unused -Wno-parentheses -fno-omit-frame-pointer -D_LITTLE_ENDIAN -g -DFULL  -DUSE_SYSTEM_ZLIB=1  -DNDEBUG -DARCH='"amd64"' -Damd64 -DLINUX -DRELEASE='"1.7.0_10"' -D_LARGEFILE64_SOURCE -D_GNU_SOURCE -D_REENTRANT -D_LP64=1 -I. -I/notnfs/nighttester/icedtea7-target-testing/openjdk.build-boot/tmp/sun/com.sun.java.util.jar.pack/unpack/CClassHeaders -I../../../../../src/solaris/javavm/export -I../../../../../src/share/javavm/export -I../../../../../src/share/native/common -I../../../../../src/solaris/native/common -I../../../../../src/share/native/com/sun/java/util/jar/pack -I../../../../../src/solaris/native/com/sun/java/util/jar/pack    -c -o /notnfs/nighttester/icedtea7-target-testing/openjdk.build-boot/tmp/sun/com.sun.java.util.jar.pack/unpack-cmd/obj64/coding.o ../../../../../src/share/native/com/sun/java/util/jar/pack/coding.cpp
/bin/mkdir -p /notnfs/nighttester/icedtea7-target-testing/openjdk.build-boot/tmp/sun/com.sun.java.util.jar.pack/unpack-cmd/obj64
rm -f /notnfs/nighttester/icedtea7-target-testing/openjdk.build-boot/tmp/sun/com.sun.java.util.jar.pack/unpack-cmd/obj64/unpack.o
/usr/bin/g++  -O2 -DPRODUCT -fPIC -DCC_NOEX -W -Wall  -Wno-unused -Wno-parentheses -fno-omit-frame-pointer -D_LITTLE_ENDIAN -g -DFULL  -DUSE_SYSTEM_ZLIB=1  -DNDEBUG -DARCH='"amd64"' -Damd64 -DLINUX -DRELEASE='"1.7.0_10"' -D_LARGEFILE64_SOURCE -D_GNU_SOURCE -D_REENTRANT -D_LP64=1 -I. -I/notnfs/nighttester/icedtea7-target-testing/openjdk.build-boot/tmp/sun/com.sun.java.util.jar.pack/unpack/CClassHeaders -I../../../../../src/solaris/javavm/export -I../../../../../src/share/javavm/export -I../../../../../src/share/native/common -I../../../../../src/solaris/native/common -I../../../../../src/share/native/com/sun/java/util/jar/pack -I../../../../../src/solaris/native/com/sun/java/util/jar/pack    -c -o /notnfs/nighttester/icedtea7-target-testing/openjdk.build-boot/tmp/sun/com.sun.java.util.jar.pack/unpack-cmd/obj64/unpack.o ../../../../../src/share/native/com/sun/java/util/jar/pack/unpack.cpp
../../../../../src/share/native/com/sun/java/util/jar/pack/unpack.cpp: In member function 'void unpacker::read_file_header()':
../../../../../src/share/native/com/sun/java/util/jar/pack/unpack.cpp:692:24: warning: comparison between signed and unsigned integer expressions [-Wsign-compare]
/bin/mkdir -p /notnfs/nighttester/icedtea7-target-testing/openjdk.build-boot/tmp/sun/com.sun.java.util.jar.pack/unpack-cmd/obj64
rm -f /notnfs/nighttester/icedtea7-target-testing/openjdk.build-boot/tmp/sun/com.sun.java.util.jar.pack/unpack-cmd/obj64/utils.o
/usr/bin/g++  -O2 -DPRODUCT -fPIC -DCC_NOEX -W -Wall  -Wno-unused -Wno-parentheses -fno-omit-frame-pointer -D_LITTLE_ENDIAN -g -DFULL  -DUSE_SYSTEM_ZLIB=1  -DNDEBUG -DARCH='"amd64"' -Damd64 -DLINUX -DRELEASE='"1.7.0_10"' -D_LARGEFILE64_SOURCE -D_GNU_SOURCE -D_REENTRANT -D_LP64=1 -I. -I/notnfs/nighttester/icedtea7-target-testing/openjdk.build-boot/tmp/sun/com.sun.java.util.jar.pack/unpack/CClassHeaders -I../../../../../src/solaris/javavm/export -I../../../../../src/share/javavm/export -I../../../../../src/share/native/common -I../../../../../src/solaris/native/common -I../../../../../src/share/native/com/sun/java/util/jar/pack -I../../../../../src/solaris/native/com/sun/java/util/jar/pack    -c -o /notnfs/nighttester/icedtea7-target-testing/openjdk.build-boot/tmp/sun/com.sun.java.util.jar.pack/unpack-cmd/obj64/utils.o ../../../../../src/share/native/com/sun/java/util/jar/pack/utils.cpp
/bin/mkdir -p /notnfs/nighttester/icedtea7-target-testing/openjdk.build-boot/tmp/sun/com.sun.java.util.jar.pack/unpack-cmd/obj64
rm -f /notnfs/nighttester/icedtea7-target-testing/openjdk.build-boot/tmp/sun/com.sun.java.util.jar.pack/unpack-cmd/obj64/zip.o
/usr/bin/g++  -O2 -DPRODUCT -fPIC -DCC_NOEX -W -Wall  -Wno-unused -Wno-parentheses -fno-omit-frame-pointer -D_LITTLE_ENDIAN -g -DFULL  -DUSE_SYSTEM_ZLIB=1  -DNDEBUG -DARCH='"amd64"' -Damd64 -DLINUX -DRELEASE='"1.7.0_10"' -D_LARGEFILE64_SOURCE -D_GNU_SOURCE -D_REENTRANT -D_LP64=1 -I. -I/notnfs/nighttester/icedtea7-target-testing/openjdk.build-boot/tmp/sun/com.sun.java.util.jar.pack/unpack/CClassHeaders -I../../../../../src/solaris/javavm/export -I../../../../../src/share/javavm/export -I../../../../../src/share/native/common -I../../../../../src/solaris/native/common -I../../../../../src/share/native/com/sun/java/util/jar/pack -I../../../../../src/solaris/native/com/sun/java/util/jar/pack    -c -o /notnfs/nighttester/icedtea7-target-testing/openjdk.build-boot/tmp/sun/com.sun.java.util.jar.pack/unpack-cmd/obj64/zip.o ../../../../../src/share/native/com/sun/java/util/jar/pack/zip.cpp
/bin/mkdir -p /notnfs/nighttester/icedtea7-target-testing/openjdk.build-boot/tmp/sun/com.sun.java.util.jar.pack/unpack-cmd/obj64
rm -f /notnfs/nighttester/icedtea7-target-testing/openjdk.build-boot/tmp/sun/com.sun.java.util.jar.pack/unpack-cmd/obj64/main.o
/usr/bin/g++  -O2 -DPRODUCT -fPIC -DCC_NOEX -W -Wall  -Wno-unused -Wno-parentheses -fno-omit-frame-pointer -D_LITTLE_ENDIAN -g -DFULL  -DUSE_SYSTEM_ZLIB=1  -DNDEBUG -DARCH='"amd64"' -Damd64 -DLINUX -DRELEASE='"1.7.0_10"' -D_LARGEFILE64_SOURCE -D_GNU_SOURCE -D_REENTRANT -D_LP64=1 -I. -I/notnfs/nighttester/icedtea7-target-testing/openjdk.build-boot/tmp/sun/com.sun.java.util.jar.pack/unpack/CClassHeaders -I../../../../../src/solaris/javavm/export -I../../../../../src/share/javavm/export -I../../../../../src/share/native/common -I../../../../../src/solaris/native/common -I../../../../../src/share/native/com/sun/java/util/jar/pack -I../../../../../src/solaris/native/com/sun/java/util/jar/pack    -c -o /notnfs/nighttester/icedtea7-target-testing/openjdk.build-boot/tmp/sun/com.sun.java.util.jar.pack/unpack-cmd/obj64/main.o ../../../../../src/share/native/com/sun/java/util/jar/pack/main.cpp
/bin/echo -e "Manifest not required for Unix"
Manifest not required for Unix
/bin/echo -e "Resource files not required for Unix"
Resource files not required for Unix
/bin/mkdir -p /notnfs/nighttester/icedtea7-target-testing/openjdk.build-boot/bin
rm -f /notnfs/nighttester/icedtea7-target-testing/openjdk.build-boot/bin/unpack200
rm -f /notnfs/nighttester/icedtea7-target-testing/openjdk.build-boot/tmp/sun/com.sun.java.util.jar.pack/unpack/mapfile-vers
/bin/cp mapfile-vers-unpack200 /notnfs/nighttester/icedtea7-target-testing/openjdk.build-boot/tmp/sun/com.sun.java.util.jar.pack/unpack/mapfile-vers
/usr/bin/g++  -O2 -DPRODUCT -fPIC -DCC_NOEX -W -Wall  -Wno-unused -Wno-parentheses -fno-omit-frame-pointer -D_LITTLE_ENDIAN -g -DFULL  -DUSE_SYSTEM_ZLIB=1  -DNDEBUG -DARCH='"amd64"' -Damd64 -DLINUX -DRELEASE='"1.7.0_10"' -D_LARGEFILE64_SOURCE -D_GNU_SOURCE -D_REENTRANT -D_LP64=1 -I. -I/notnfs/nighttester/icedtea7-target-testing/openjdk.build-boot/tmp/sun/com.sun.java.util.jar.pack/unpack/CClassHeaders -I../../../../../src/solaris/javavm/export -I../../../../../src/share/javavm/export -I../../../../../src/share/native/common -I../../../../../src/solaris/native/common -I../../../../../src/share/native/com/sun/java/util/jar/pack -I../../../../../src/solaris/native/com/sun/java/util/jar/pack   -Xlinker -O1 -Xlinker -version-script=mapfile-vers  -Wl,--hash-style=both -Xlinker -z -Xlinker origin  -Xlinker -rpath -Xlinker \$ORIGIN  -Xlinker -z -Xlinker defs -L/notnfs/nighttester/icedtea7-target-testing/openjdk.build-boot/lib/amd64 -Wl,-soname=libunpack.so     /notnfs/nighttester/icedtea7-target-testing/openjdk.build-boot/tmp/sun/com.sun.java.util.jar.pack/unpack-cmd/obj64/bands.o /notnfs/nighttester/icedtea7-target-testing/openjdk.build-boot/tmp/sun/com.sun.java.util.jar.pack/unpack-cmd/obj64/bytes.o /notnfs/nighttester/icedtea7-target-testing/openjdk.build-boot/tmp/sun/com.sun.java.util.jar.pack/unpack-cmd/obj64/coding.o /notnfs/nighttester/icedtea7-target-testing/openjdk.build-boot/tmp/sun/com.sun.java.util.jar.pack/unpack-cmd/obj64/unpack.o /notnfs/nighttester/icedtea7-target-testing/openjdk.build-boot/tmp/sun/com.sun.java.util.jar.pack/unpack-cmd/obj64/utils.o /notnfs/nighttester/icedtea7-target-testing/openjdk.build-boot/tmp/sun/com.sun.java.util.jar.pack/unpack-cmd/obj64/zip.o /notnfs/nighttester/icedtea7-target-testing/openjdk.build-boot/tmp/sun/com.sun.java.util.jar.pack/unpack-cmd/obj64/main.o  -lz   -lc -lstdc++ -o /notnfs/nighttester/icedtea7-target-testing/openjdk.build-boot/tmp/sun/com.sun.java.util.jar.pack/unpack/unpack200
/bin/cp /notnfs/nighttester/icedtea7-target-testing/openjdk.build-boot/tmp/sun/com.sun.java.util.jar.pack/unpack/unpack200 /notnfs/nighttester/icedtea7-target-testing/openjdk.build-boot/bin/unpack200
Checking for mapfile use in: /notnfs/nighttester/icedtea7-target-testing/openjdk.build-boot/bin/unpack200
Library loads for: /notnfs/nighttester/icedtea7-target-testing/openjdk.build-boot/bin/unpack200
	linux-vdso.so.1 =>  (0x00007fff4eda2000)
	libz.so.1 => /lib64/libz.so.1 (0x00000039b4400000)
	libstdc++.so.6 => /usr/lib64/libstdc++.so.6 (0x00000039bf800000)
	libm.so.6 => /lib64/libm.so.6 (0x00000039b4800000)
	libc.so.6 => /lib64/libc.so.6 (0x00000039b3400000)
	libgcc_s.so.1 => /lib64/libgcc_s.so.1 (0x00000039b4c00000)
	/lib64/ld-linux-x86-64.so.2 (0x00000039b3000000)
RUNPATH for: /notnfs/nighttester/icedtea7-target-testing/openjdk.build-boot/bin/unpack200
 0x0000000000000001 (NEEDED)             Shared library: [libz.so.1]
 0x0000000000000001 (NEEDED)             Shared library: [libstdc++.so.6]
 0x0000000000000001 (NEEDED)             Shared library: [libm.so.6]
 0x0000000000000001 (NEEDED)             Shared library: [libc.so.6]
 0x0000000000000001 (NEEDED)             Shared library: [libgcc_s.so.1]
 0x000000000000000f (RPATH)              Library rpath: [$ORIGIN]
make[8]: Leaving directory `/notnfs/nighttester/icedtea7-target-testing/openjdk-boot/jdk/make/com/sun/java/pack'
/usr/bin/make -C prop
INFO: ENABLE_FULL_DEBUG_SYMBOLS=1
INFO: /usr/bin/objcopy cmd found so will create .debuginfo files.
INFO: STRIP_POLICY=no_strip
INFO: ZIP_DEBUGINFO_FILES=1
make[8]: Entering directory `/notnfs/nighttester/icedtea7-target-testing/openjdk-boot/jdk/make/com/sun/java/pack/prop'
/bin/mkdir -p /notnfs/nighttester/icedtea7-target-testing/openjdk.build-boot/classes/com/sun/java/util/jar/pack
rm -f /notnfs/nighttester/icedtea7-target-testing/openjdk.build-boot/classes/com/sun/java/util/jar/pack/intrinsic.properties
/bin/cp ../../../../../../src/share/classes/com/sun/java/util/jar/pack/intrinsic.properties /notnfs/nighttester/icedtea7-target-testing/openjdk.build-boot/classes/com/sun/java/util/jar/pack/intrinsic.properties
/bin/chmod  a+rw /notnfs/nighttester/icedtea7-target-testing/openjdk.build-boot/classes/com/sun/java/util/jar/pack/intrinsic.properties
# Adding to strip properties list: /notnfs/nighttester/icedtea7-target-testing/openjdk.build-boot/classes/com/sun/java/util/jar/pack/intrinsic.properties
/bin/echo -e "/notnfs/nighttester/icedtea7-target-testing/openjdk.build-boot/classes/com/sun/java/util/jar/pack/intrinsic.properties" >> /notnfs/nighttester/icedtea7-target-testing/openjdk.build-boot/tmp/sun/com.sun.java.util.jar.pack/strip_prop_options
/notnfs/nighttester/icedtea7-target-testing/bootstrap/jdk1.6.0/bin/java -XX:-PrintVMOptions -XX:+UnlockDiagnosticVMOptions -XX:-LogVMOutput -Xmx512m -Xms512m -XX:PermSize=32m -XX:MaxPermSize=160m -jar /notnfs/nighttester/icedtea7-target-testing/openjdk.build-boot/btjars/stripproperties.jar -optionsfile /notnfs/nighttester/icedtea7-target-testing/openjdk.build-boot/tmp/sun/com.sun.java.util.jar.pack/strip_prop_options
make[8]: Leaving directory `/notnfs/nighttester/icedtea7-target-testing/openjdk-boot/jdk/make/com/sun/java/pack/prop'
cd  ../../../../launchers && /usr/bin/make -f Makefile.launcher PROGRAM=pack200 MAIN_CLASS=com.sun.java.util.jar.pack.Driver MAIN_JAVA_ARGS="" MAIN_ARGS="--pack"
INFO: ENABLE_FULL_DEBUG_SYMBOLS=1
INFO: /usr/bin/objcopy cmd found so will create .debuginfo files.
INFO: STRIP_POLICY=no_strip
INFO: ZIP_DEBUGINFO_FILES=1
make[8]: Entering directory `/notnfs/nighttester/icedtea7-target-testing/openjdk-boot/jdk/make/launchers'
=========================================================
LAUNCHER:        pack200
MAIN_CLASS:      com.sun.java.util.jar.pack.Driver
MAIN_ARGS:       --pack
ALL_ARGS:        -J-ms8m  com.sun.java.util.jar.pack.Driver --pack
=========================================================
gcc  -O2   -fno-strict-aliasing -fPIC -W -Wall  -Wno-unused -Wno-parentheses -pipe -fno-omit-frame-pointer -D_LITTLE_ENDIAN -g   -DNDEBUG -DARCH='"amd64"' -Damd64 -DLINUX -DRELEASE='"1.7.0_10"' -DFULL_VERSION='"1.7.0_10-b08"' -DJDK_MAJOR_VERSION='"1"' -DJDK_MINOR_VERSION='"7"' -D_LARGEFILE64_SOURCE -D_GNU_SOURCE -D_REENTRANT -D_LP64=1 -I. -I/notnfs/nighttester/icedtea7-target-testing/openjdk.build-boot/tmp/sun/launcher/pack200/CClassHeaders -I../../src/solaris/javavm/export -I../../src/share/javavm/export -I../../src/share/bin -I../../src/solaris/bin -DMAIN_CLASS='"com.sun.java.util.jar.pack.Driver"' -DJAVA_ARGS='{ "-J-ms8m", "com.sun.java.util.jar.pack.Driver", "--pack",  }' -DLAUNCHER_NAME='"java"' -DPROGNAME='"pack200"'    -c -o /notnfs/nighttester/icedtea7-target-testing/openjdk.build-boot/tmp/sun/launcher/pack200/obj64/main.o \
	-DRELEASE='"1.7.0_10"' -DFULL_VERSION='"1.7.0_10-b08"' -DJDK_MAJOR_VERSION='"1"' -DJDK_MINOR_VERSION='"7"' ../../src/share/bin/main.c
Rebuilding /notnfs/nighttester/icedtea7-target-testing/openjdk.build-boot/bin/pack200 because of /notnfs/nighttester/icedtea7-target-testing/openjdk.build-boot/tmp/sun/launcher/pack200/obj64/main.o
gcc -o /notnfs/nighttester/icedtea7-target-testing/openjdk.build-boot/bin/pack200 -Xlinker -O1 -Xlinker -version-script=../java/main/java/mapfile-amd64  -Wl,--hash-style=both -Xlinker -z -Xlinker defs -L/notnfs/nighttester/icedtea7-target-testing/openjdk.build-boot/lib/amd64 -Wl,-soname=lib.so  -L /notnfs/nighttester/icedtea7-target-testing/openjdk.build-boot/lib/amd64/jli  -Wl,--allow-shlib-undefined -Wl,-rpath -Wl,\$ORIGIN/../lib/amd64/jli -Wl,-rpath -Wl,\$ORIGIN/../jre/lib/amd64/jli -Wl,-rpath -Wl,\$ORIGIN/../lib/amd64 -Wl,-rpath -Wl,\$ORIGIN/../jre/lib/amd64 \
/notnfs/nighttester/icedtea7-target-testing/openjdk.build-boot/tmp/sun/launcher/pack200/obj64/main.o -lpthread  -ljli -lz    -ldl -lc
Checking for mapfile use in: /notnfs/nighttester/icedtea7-target-testing/openjdk.build-boot/bin/pack200
Library loads for: /notnfs/nighttester/icedtea7-target-testing/openjdk.build-boot/bin/pack200
	linux-vdso.so.1 =>  (0x00007fffe63d9000)
	libpthread.so.0 => /lib64/libpthread.so.0 (0x00000039b3800000)
	libjli.so => /notnfs/nighttester/icedtea7-target-testing/openjdk.build-boot/bin/../lib/amd64/jli/libjli.so (0x00007f51b0cf6000)
	libz.so.1 => /lib64/libz.so.1 (0x00000039b4400000)
	libdl.so.2 => /lib64/libdl.so.2 (0x00000039b3c00000)
	libc.so.6 => /lib64/libc.so.6 (0x00000039b3400000)
	/lib64/ld-linux-x86-64.so.2 (0x00000039b3000000)
RUNPATH for: /notnfs/nighttester/icedtea7-target-testing/openjdk.build-boot/bin/pack200
 0x0000000000000001 (NEEDED)             Shared library: [libpthread.so.0]
 0x0000000000000001 (NEEDED)             Shared library: [libjli.so]
 0x0000000000000001 (NEEDED)             Shared library: [libz.so.1]
 0x0000000000000001 (NEEDED)             Shared library: [libdl.so.2]
 0x0000000000000001 (NEEDED)             Shared library: [libc.so.6]
 0x000000000000000f (RPATH)              Library rpath: [$ORIGIN/../lib/amd64/jli:$ORIGIN/../jre/lib/amd64/jli:$ORIGIN/../lib/amd64:$ORIGIN/../jre/lib/amd64]
make[8]: Leaving directory `/notnfs/nighttester/icedtea7-target-testing/openjdk-boot/jdk/make/launchers'
make[7]: Leaving directory `/notnfs/nighttester/icedtea7-target-testing/openjdk-boot/jdk/make/com/sun/java/pack'
INFO: ENABLE_FULL_DEBUG_SYMBOLS=1
INFO: /usr/bin/objcopy cmd found so will create .debuginfo files.
INFO: STRIP_POLICY=no_strip
INFO: ZIP_DEBUGINFO_FILES=1
make[7]: Entering directory `/notnfs/nighttester/icedtea7-target-testing/openjdk-boot/jdk/make/com/sun/java/browser'
Begin Processing SUBDIRS: dom net     
INFO: ENABLE_FULL_DEBUG_SYMBOLS=1
INFO: /usr/bin/objcopy cmd found so will create .debuginfo files.
INFO: STRIP_POLICY=no_strip
INFO: ZIP_DEBUGINFO_FILES=1
make[8]: Entering directory `/notnfs/nighttester/icedtea7-target-testing/openjdk-boot/jdk/make/com/sun/java/browser/dom'
# Java sources to be compiled: (listed in file /notnfs/nighttester/icedtea7-target-testing/openjdk.build-boot/tmp/plugin/com.sun.java.browser.dom/.classes.list)
../../../../../../src/share/classes/com/sun/java/browser/dom/DOMAccessException.java
../../../../../../src/share/classes/com/sun/java/browser/dom/DOMAccessor.java
../../../../../../src/share/classes/com/sun/java/browser/dom/DOMAction.java
../../../../../../src/share/classes/com/sun/java/browser/dom/DOMService.java
../../../../../../src/share/classes/com/sun/java/browser/dom/DOMServiceProvider.java
../../../../../../src/share/classes/com/sun/java/browser/dom/DOMUnsupportedException.java
# Running javac:
/notnfs/nighttester/icedtea7-target-testing/bootstrap/jdk1.6.0/bin/javac -J-XX:ThreadStackSize=1536 -J-XX:-PrintVMOptions -J-XX:+UnlockDiagnosticVMOptions -J-XX:-LogVMOutput -J-Xmx512m -J-Xms512m -J-XX:PermSize=32m -J-XX:MaxPermSize=160m -g -source 7 -target 7 -encoding ascii -Xbootclasspath:/notnfs/nighttester/icedtea7-target-testing/openjdk.build-boot/classes -sourcepath /notnfs/nighttester/icedtea7-target-testing/generated.build:../../../../../../src/solaris/classes:../../../../../../src/share/classes -bootclasspath /notnfs/nighttester/icedtea7-target-testing/openjdk.build-boot/classes:/notnfs/nighttester/icedtea7-target-testing/bootstrap/jdk1.6.0/jre/lib/rt.jar -d /notnfs/nighttester/icedtea7-target-testing/openjdk.build-boot/classes @/notnfs/nighttester/icedtea7-target-testing/openjdk.build-boot/tmp/plugin/com.sun.java.browser.dom/.classes.list
Annotation processing got disabled, since it requires a 1.6 compliant JVM
make[8]: Leaving directory `/notnfs/nighttester/icedtea7-target-testing/openjdk-boot/jdk/make/com/sun/java/browser/dom'
INFO: ENABLE_FULL_DEBUG_SYMBOLS=1
INFO: /usr/bin/objcopy cmd found so will create .debuginfo files.
INFO: STRIP_POLICY=no_strip
INFO: ZIP_DEBUGINFO_FILES=1
make[8]: Entering directory `/notnfs/nighttester/icedtea7-target-testing/openjdk-boot/jdk/make/com/sun/java/browser/net'
# Java sources to be compiled: (listed in file /notnfs/nighttester/icedtea7-target-testing/openjdk.build-boot/tmp/plugin/com.sun.java.browser.net/.classes.list)
../../../../../../src/share/classes/com/sun/java/browser/net/ProxyInfo.java
../../../../../../src/share/classes/com/sun/java/browser/net/ProxyService.java
../../../../../../src/share/classes/com/sun/java/browser/net/ProxyServiceProvider.java
# Running javac:
/notnfs/nighttester/icedtea7-target-testing/bootstrap/jdk1.6.0/bin/javac -J-XX:ThreadStackSize=1536 -J-XX:-PrintVMOptions -J-XX:+UnlockDiagnosticVMOptions -J-XX:-LogVMOutput -J-Xmx512m -J-Xms512m -J-XX:PermSize=32m -J-XX:MaxPermSize=160m -g -source 7 -target 7 -encoding ascii -Xbootclasspath:/notnfs/nighttester/icedtea7-target-testing/openjdk.build-boot/classes -sourcepath /notnfs/nighttester/icedtea7-target-testing/generated.build:../../../../../../src/solaris/classes:../../../../../../src/share/classes -bootclasspath /notnfs/nighttester/icedtea7-target-testing/openjdk.build-boot/classes:/notnfs/nighttester/icedtea7-target-testing/bootstrap/jdk1.6.0/jre/lib/rt.jar -d /notnfs/nighttester/icedtea7-target-testing/openjdk.build-boot/classes @/notnfs/nighttester/icedtea7-target-testing/openjdk.build-boot/tmp/plugin/com.sun.java.browser.net/.classes.list
Annotation processing got disabled, since it requires a 1.6 compliant JVM
make[8]: Leaving directory `/notnfs/nighttester/icedtea7-target-testing/openjdk-boot/jdk/make/com/sun/java/browser/net'
Done Processing SUBDIRS: dom net     
make[7]: Leaving directory `/notnfs/nighttester/icedtea7-target-testing/openjdk-boot/jdk/make/com/sun/java/browser'
Done Processing SUBDIRS: pack    browser 
make[6]: Leaving directory `/notnfs/nighttester/icedtea7-target-testing/openjdk-boot/jdk/make/com/sun/java'
INFO: ENABLE_FULL_DEBUG_SYMBOLS=1
INFO: /usr/bin/objcopy cmd found so will create .debuginfo files.
INFO: STRIP_POLICY=no_strip
INFO: ZIP_DEBUGINFO_FILES=1
make[6]: Entering directory `/notnfs/nighttester/icedtea7-target-testing/openjdk-boot/jdk/make/com/sun/security'
Begin Processing SUBDIRS: auth    jgss sasl auth/module 
INFO: ENABLE_FULL_DEBUG_SYMBOLS=1
INFO: /usr/bin/objcopy cmd found so will create .debuginfo files.
INFO: STRIP_POLICY=no_strip
INFO: ZIP_DEBUGINFO_FILES=1
make[7]: Entering directory `/notnfs/nighttester/icedtea7-target-testing/openjdk-boot/jdk/make/com/sun/security/auth'
rm -f /notnfs/nighttester/icedtea7-target-testing/generated.build/sun/security/util/AuthResources_zh_HK.java
/bin/cat ../../../../../src/share/classes/sun/security/util/AuthResources_zh_TW.java | /bin/sed -e '/class/s/_zh_TW/_zh_HK/' > /notnfs/nighttester/icedtea7-target-testing/generated.build/sun/security/util/AuthResources_zh_HK.java
# Java sources to be compiled: (listed in file /notnfs/nighttester/icedtea7-target-testing/openjdk.build-boot/tmp/sun/com.sun.security.auth/.classes.list)
../../../../../src/share/classes/com/sun/security/auth/LdapPrincipal.java
../../../../../src/share/classes/com/sun/security/auth/NTDomainPrincipal.java
../../../../../src/share/classes/com/sun/security/auth/NTNumericCredential.java
../../../../../src/share/classes/com/sun/security/auth/NTSid.java
../../../../../src/share/classes/com/sun/security/auth/NTSidDomainPrincipal.java
../../../../../src/share/classes/com/sun/security/auth/NTSidGroupPrincipal.java
../../../../../src/share/classes/com/sun/security/auth/NTSidPrimaryGroupPrincipal.java
../../../../../src/share/classes/com/sun/security/auth/NTSidUserPrincipal.java
../../../../../src/share/classes/com/sun/security/auth/NTUserPrincipal.java
../../../../../src/share/classes/com/sun/security/auth/PolicyFile.java
../../../../../src/share/classes/com/sun/security/auth/PolicyParser.java
../../../../../src/share/classes/com/sun/security/auth/PrincipalComparator.java
../../../../../src/share/classes/com/sun/security/auth/SolarisNumericGroupPrincipal.java
../../../../../src/share/classes/com/sun/security/auth/SolarisNumericUserPrincipal.java
../../../../../src/share/classes/com/sun/security/auth/SolarisPrincipal.java
../../../../../src/share/classes/com/sun/security/auth/SubjectCodeSource.java
../../../../../src/share/classes/com/sun/security/auth/UnixNumericGroupPrincipal.java
../../../../../src/share/classes/com/sun/security/auth/UnixNumericUserPrincipal.java
../../../../../src/share/classes/com/sun/security/auth/UnixPrincipal.java
../../../../../src/share/classes/com/sun/security/auth/UserPrincipal.java
../../../../../src/share/classes/com/sun/security/auth/X500Principal.java
../../../../../src/share/classes/com/sun/security/auth/callback/DialogCallbackHandler.java
/notnfs/nighttester/icedtea7-target-testing/generated.build/sun/security/util/AuthResources_zh_HK.java
# Running javac:
/notnfs/nighttester/icedtea7-target-testing/bootstrap/jdk1.6.0/bin/javac -J-XX:ThreadStackSize=1536 -J-XX:-PrintVMOptions -J-XX:+UnlockDiagnosticVMOptions -J-XX:-LogVMOutput -J-Xmx512m -J-Xms512m -J-XX:PermSize=32m -J-XX:MaxPermSize=160m -g -source 7 -target 7 -encoding ascii -Xbootclasspath:/notnfs/nighttester/icedtea7-target-testing/openjdk.build-boot/classes -sourcepath /notnfs/nighttester/icedtea7-target-testing/generated.build:../../../../../src/solaris/classes:../../../../../src/share/classes -bootclasspath /notnfs/nighttester/icedtea7-target-testing/openjdk.build-boot/classes:/notnfs/nighttester/icedtea7-target-testing/bootstrap/jdk1.6.0/jre/lib/rt.jar -d /notnfs/nighttester/icedtea7-target-testing/openjdk.build-boot/classes @/notnfs/nighttester/icedtea7-target-testing/openjdk.build-boot/tmp/sun/com.sun.security.auth/.classes.list
Annotation processing got disabled, since it requires a 1.6 compliant JVM
----------
1. ERROR in ../../../../../src/share/classes/com/sun/security/auth/NTSidPrimaryGroupPrincipal.java (at line 0)
	/*
	^
Internal compiler error
java.lang.NullPointerException
   at org.eclipse.jdt.internal.compiler.ReadManager.run(ReadManager.java:166)
   at java.lang.Thread.run(libgcj.so.12)

----------
1 problem (1 error)make[7]: *** [.compile.classlist] Error 255
rm /notnfs/nighttester/icedtea7-target-testing/generated.build/sun/security/util/AuthResources_zh_HK.java
make[7]: Leaving directory `/notnfs/nighttester/icedtea7-target-testing/openjdk-boot/jdk/make/com/sun/security/auth'
make[6]: *** [all] Error 1
make[6]: Leaving directory `/notnfs/nighttester/icedtea7-target-testing/openjdk-boot/jdk/make/com/sun/security'
make[5]: *** [all] Error 1
make[5]: Leaving directory `/notnfs/nighttester/icedtea7-target-testing/openjdk-boot/jdk/make/com/sun'
make[4]: *** [all] Error 1
make[4]: Leaving directory `/notnfs/nighttester/icedtea7-target-testing/openjdk-boot/jdk/make/com'
make[3]: *** [all] Error 1
make[3]: Leaving directory `/notnfs/nighttester/icedtea7-target-testing/openjdk-boot/jdk/make'
make[2]: *** [jdk-build] Error 2
make[2]: Leaving directory `/notnfs/nighttester/icedtea7-target-testing/openjdk-boot'
make[1]: *** [build_product_image] Error 2
make[1]: Leaving directory `/notnfs/nighttester/icedtea7-target-testing/openjdk-boot'
make: *** [stamps/icedtea-boot.stamp] Error 2
+ exit 1
Build step 'Execute shell' marked build as failure


More information about the icedtea-test mailing list