Build failed in Jenkins: IcedTea7TargetTesting #1639

Hudson Admin gnu.andrew at redhat.com
Fri May 9 07:53:08 UTC 2014


See <http://toadeater.yyz.redhat.com:8080/job/IcedTea7TargetTesting/1639/>

------------------------------------------
[...truncated 38383 lines...]
../../../src/share/classes/javax/sql/PooledConnection.java
../../../src/share/classes/javax/sql/RowSet.java
../../../src/share/classes/javax/sql/RowSetEvent.java
../../../src/share/classes/javax/sql/RowSetInternal.java
../../../src/share/classes/javax/sql/RowSetListener.java
../../../src/share/classes/javax/sql/RowSetMetaData.java
../../../src/share/classes/javax/sql/RowSetReader.java
../../../src/share/classes/javax/sql/RowSetWriter.java
../../../src/share/classes/javax/sql/StatementEvent.java
../../../src/share/classes/javax/sql/StatementEventListener.java
../../../src/share/classes/javax/sql/XAConnection.java
../../../src/share/classes/javax/sql/XADataSource.java
../../../src/share/classes/javax/sql/rowset/BaseRowSet.java
../../../src/share/classes/javax/sql/rowset/CachedRowSet.java
../../../src/share/classes/javax/sql/rowset/FilteredRowSet.java
../../../src/share/classes/javax/sql/rowset/JdbcRowSet.java
../../../src/share/classes/javax/sql/rowset/JoinRowSet.java
../../../src/share/classes/javax/sql/rowset/Joinable.java
../../../src/share/classes/javax/sql/rowset/Predicate.java
../../../src/share/classes/javax/sql/rowset/RowSetFactory.java
../../../src/share/classes/javax/sql/rowset/RowSetMetaDataImpl.java
../../../src/share/classes/javax/sql/rowset/RowSetProvider.java
../../../src/share/classes/javax/sql/rowset/WebRowSet.java
../../../src/share/classes/javax/sql/rowset/serial/SQLInputImpl.java
../../../src/share/classes/javax/sql/rowset/serial/SQLOutputImpl.java
../../../src/share/classes/javax/sql/rowset/serial/SerialArray.java
../../../src/share/classes/javax/sql/rowset/serial/SerialBlob.java
../../../src/share/classes/javax/sql/rowset/serial/SerialClob.java
../../../src/share/classes/javax/sql/rowset/serial/SerialDatalink.java
../../../src/share/classes/javax/sql/rowset/serial/SerialRef.java
../../../src/share/classes/javax/sql/rowset/serial/SerialStruct.java
../../../src/share/classes/javax/sql/rowset/spi/SyncFactory.java
../../../src/share/classes/javax/sql/rowset/spi/SyncFactoryException.java
../../../src/share/classes/javax/sql/rowset/spi/SyncProvider.java
../../../src/share/classes/javax/sql/rowset/spi/SyncProviderException.java
../../../src/share/classes/javax/sql/rowset/spi/SyncResolver.java
../../../src/share/classes/javax/sql/rowset/spi/TransactionalWriter.java
../../../src/share/classes/javax/sql/rowset/spi/XmlReader.java
../../../src/share/classes/javax/sql/rowset/spi/XmlWriter.java
# Running javac:
/notnfs/nighttester/icedtea7-target-testing/bootstrap/jdk1.6.0/bin/javac -J-XX:ThreadStackSize=1664 -J-XX:-PrintVMOptions -J-XX:+UnlockDiagnosticVMOptions -J-XX:-LogVMOutput -J-Xmx512m -J-Xms512m -J-XX:PermSize=32m -J-XX:MaxPermSize=160m -g -source 7 -target 7 -encoding ascii -Xbootclasspath:/notnfs/nighttester/icedtea7-target-testing/openjdk.build-boot/classes -sourcepath /notnfs/nighttester/icedtea7-target-testing/generated.build:../../../src/solaris/classes:../../../src/share/classes -bootclasspath /notnfs/nighttester/icedtea7-target-testing/openjdk.build-boot/classes:/notnfs/nighttester/icedtea7-target-testing/bootstrap/jdk1.6.0/jre/lib/rt.jar -d /notnfs/nighttester/icedtea7-target-testing/openjdk.build-boot/classes @/notnfs/nighttester/icedtea7-target-testing/openjdk.build-boot/tmp/sun/javax.sql/.classes.list
Annotation processing got disabled, since it requires a 1.6 compliant JVM
gmake[5]: Leaving directory `/notnfs/nighttester/icedtea7-target-testing/openjdk-boot/jdk/make/javax/sql'
INFO: ENABLE_FULL_DEBUG_SYMBOLS=1
INFO: /usr/bin/objcopy cmd found so will create .debuginfo files.
INFO: STRIP_POLICY=no_strip
INFO: ZIP_DEBUGINFO_FILES=1
gmake[5]: Entering directory `/notnfs/nighttester/icedtea7-target-testing/openjdk-boot/jdk/make/javax/rmi'
Begin Processing SUBDIRS: ssl     
INFO: ENABLE_FULL_DEBUG_SYMBOLS=1
INFO: /usr/bin/objcopy cmd found so will create .debuginfo files.
INFO: STRIP_POLICY=no_strip
INFO: ZIP_DEBUGINFO_FILES=1
gmake[6]: Entering directory `/notnfs/nighttester/icedtea7-target-testing/openjdk-boot/jdk/make/javax/rmi/ssl'
# Java sources to be compiled: (listed in file /notnfs/nighttester/icedtea7-target-testing/openjdk.build-boot/tmp/sun/javax.rmi.ssl/.classes.list)
../../../../src/share/classes/javax/rmi/ssl/SslRMIClientSocketFactory.java
../../../../src/share/classes/javax/rmi/ssl/SslRMIServerSocketFactory.java
# Running javac:
/notnfs/nighttester/icedtea7-target-testing/bootstrap/jdk1.6.0/bin/javac -J-XX:ThreadStackSize=1664 -J-XX:-PrintVMOptions -J-XX:+UnlockDiagnosticVMOptions -J-XX:-LogVMOutput -J-Xmx512m -J-Xms512m -J-XX:PermSize=32m -J-XX:MaxPermSize=160m -g -source 7 -target 7 -encoding ascii -Xbootclasspath:/notnfs/nighttester/icedtea7-target-testing/openjdk.build-boot/classes -sourcepath /notnfs/nighttester/icedtea7-target-testing/generated.build:../../../../src/solaris/classes:../../../../src/share/classes -bootclasspath /notnfs/nighttester/icedtea7-target-testing/openjdk.build-boot/classes:/notnfs/nighttester/icedtea7-target-testing/bootstrap/jdk1.6.0/jre/lib/rt.jar -d /notnfs/nighttester/icedtea7-target-testing/openjdk.build-boot/classes @/notnfs/nighttester/icedtea7-target-testing/openjdk.build-boot/tmp/sun/javax.rmi.ssl/.classes.list
Annotation processing got disabled, since it requires a 1.6 compliant JVM
gmake[6]: Leaving directory `/notnfs/nighttester/icedtea7-target-testing/openjdk-boot/jdk/make/javax/rmi/ssl'
Done Processing SUBDIRS: ssl     
gmake[5]: Leaving directory `/notnfs/nighttester/icedtea7-target-testing/openjdk-boot/jdk/make/javax/rmi'
Done Processing SUBDIRS: others accessibility print swing sound imageio  management crypto sql rmi 
gmake[4]: Leaving directory `/notnfs/nighttester/icedtea7-target-testing/openjdk-boot/jdk/make/javax'
INFO: ENABLE_FULL_DEBUG_SYMBOLS=1
INFO: /usr/bin/objcopy cmd found so will create .debuginfo files.
INFO: STRIP_POLICY=no_strip
INFO: ZIP_DEBUGINFO_FILES=1
gmake[4]: Entering directory `/notnfs/nighttester/icedtea7-target-testing/openjdk-boot/jdk/make/sun'
Begin Processing SUBDIRS: jar security javazic misc net nio text launcher audio pisces image  awt splashscreen xawt headless   jawt font jpeg cmm applet beans  management  rmi  tracing native2ascii serialver tools jconsole
INFO: ENABLE_FULL_DEBUG_SYMBOLS=1
INFO: /usr/bin/objcopy cmd found so will create .debuginfo files.
INFO: STRIP_POLICY=no_strip
INFO: ZIP_DEBUGINFO_FILES=1
gmake[5]: Entering directory `/notnfs/nighttester/icedtea7-target-testing/openjdk-boot/jdk/make/sun/jar'
rm -f /notnfs/nighttester/icedtea7-target-testing/generated.build/sun/tools/jar/resources/jar.java
# Adding to compile properties list: ../../../src/share/classes/sun/tools/jar/resources/jar.properties -> /notnfs/nighttester/icedtea7-target-testing/generated.build/sun/tools/jar/resources/jar.java
/bin/echo -e "-compile ../../../src/share/classes/sun/tools/jar/resources/jar.properties /notnfs/nighttester/icedtea7-target-testing/generated.build/sun/tools/jar/resources/jar.java ListResourceBundle" >> /notnfs/nighttester/icedtea7-target-testing/openjdk.build-boot/tmp/sun/sun.tools/compile_prop_options
rm -f /notnfs/nighttester/icedtea7-target-testing/generated.build/sun/tools/jar/resources/jar_de.java
# Adding to compile properties list: ../../../src/share/classes/sun/tools/jar/resources/jar_de.properties -> /notnfs/nighttester/icedtea7-target-testing/generated.build/sun/tools/jar/resources/jar_de.java
/bin/echo -e "-compile ../../../src/share/classes/sun/tools/jar/resources/jar_de.properties /notnfs/nighttester/icedtea7-target-testing/generated.build/sun/tools/jar/resources/jar_de.java ListResourceBundle" >> /notnfs/nighttester/icedtea7-target-testing/openjdk.build-boot/tmp/sun/sun.tools/compile_prop_options
rm -f /notnfs/nighttester/icedtea7-target-testing/generated.build/sun/tools/jar/resources/jar_es.java
# Adding to compile properties list: ../../../src/share/classes/sun/tools/jar/resources/jar_es.properties -> /notnfs/nighttester/icedtea7-target-testing/generated.build/sun/tools/jar/resources/jar_es.java
/bin/echo -e "-compile ../../../src/share/classes/sun/tools/jar/resources/jar_es.properties /notnfs/nighttester/icedtea7-target-testing/generated.build/sun/tools/jar/resources/jar_es.java ListResourceBundle" >> /notnfs/nighttester/icedtea7-target-testing/openjdk.build-boot/tmp/sun/sun.tools/compile_prop_options
rm -f /notnfs/nighttester/icedtea7-target-testing/generated.build/sun/tools/jar/resources/jar_fr.java
# Adding to compile properties list: ../../../src/share/classes/sun/tools/jar/resources/jar_fr.properties -> /notnfs/nighttester/icedtea7-target-testing/generated.build/sun/tools/jar/resources/jar_fr.java
/bin/echo -e "-compile ../../../src/share/classes/sun/tools/jar/resources/jar_fr.properties /notnfs/nighttester/icedtea7-target-testing/generated.build/sun/tools/jar/resources/jar_fr.java ListResourceBundle" >> /notnfs/nighttester/icedtea7-target-testing/openjdk.build-boot/tmp/sun/sun.tools/compile_prop_options
rm -f /notnfs/nighttester/icedtea7-target-testing/generated.build/sun/tools/jar/resources/jar_it.java
# Adding to compile properties list: ../../../src/share/classes/sun/tools/jar/resources/jar_it.properties -> /notnfs/nighttester/icedtea7-target-testing/generated.build/sun/tools/jar/resources/jar_it.java
/bin/echo -e "-compile ../../../src/share/classes/sun/tools/jar/resources/jar_it.properties /notnfs/nighttester/icedtea7-target-testing/generated.build/sun/tools/jar/resources/jar_it.java ListResourceBundle" >> /notnfs/nighttester/icedtea7-target-testing/openjdk.build-boot/tmp/sun/sun.tools/compile_prop_options
rm -f /notnfs/nighttester/icedtea7-target-testing/generated.build/sun/tools/jar/resources/jar_ja.java
# Adding to compile properties list: ../../../src/share/classes/sun/tools/jar/resources/jar_ja.properties -> /notnfs/nighttester/icedtea7-target-testing/generated.build/sun/tools/jar/resources/jar_ja.java
/bin/echo -e "-compile ../../../src/share/classes/sun/tools/jar/resources/jar_ja.properties /notnfs/nighttester/icedtea7-target-testing/generated.build/sun/tools/jar/resources/jar_ja.java ListResourceBundle" >> /notnfs/nighttester/icedtea7-target-testing/openjdk.build-boot/tmp/sun/sun.tools/compile_prop_options
rm -f /notnfs/nighttester/icedtea7-target-testing/generated.build/sun/tools/jar/resources/jar_ko.java
# Adding to compile properties list: ../../../src/share/classes/sun/tools/jar/resources/jar_ko.properties -> /notnfs/nighttester/icedtea7-target-testing/generated.build/sun/tools/jar/resources/jar_ko.java
/bin/echo -e "-compile ../../../src/share/classes/sun/tools/jar/resources/jar_ko.properties /notnfs/nighttester/icedtea7-target-testing/generated.build/sun/tools/jar/resources/jar_ko.java ListResourceBundle" >> /notnfs/nighttester/icedtea7-target-testing/openjdk.build-boot/tmp/sun/sun.tools/compile_prop_options
rm -f /notnfs/nighttester/icedtea7-target-testing/generated.build/sun/tools/jar/resources/jar_pt_BR.java
# Adding to compile properties list: ../../../src/share/classes/sun/tools/jar/resources/jar_pt_BR.properties -> /notnfs/nighttester/icedtea7-target-testing/generated.build/sun/tools/jar/resources/jar_pt_BR.java
/bin/echo -e "-compile ../../../src/share/classes/sun/tools/jar/resources/jar_pt_BR.properties /notnfs/nighttester/icedtea7-target-testing/generated.build/sun/tools/jar/resources/jar_pt_BR.java ListResourceBundle" >> /notnfs/nighttester/icedtea7-target-testing/openjdk.build-boot/tmp/sun/sun.tools/compile_prop_options
rm -f /notnfs/nighttester/icedtea7-target-testing/generated.build/sun/tools/jar/resources/jar_sv.java
# Adding to compile properties list: ../../../src/share/classes/sun/tools/jar/resources/jar_sv.properties -> /notnfs/nighttester/icedtea7-target-testing/generated.build/sun/tools/jar/resources/jar_sv.java
/bin/echo -e "-compile ../../../src/share/classes/sun/tools/jar/resources/jar_sv.properties /notnfs/nighttester/icedtea7-target-testing/generated.build/sun/tools/jar/resources/jar_sv.java ListResourceBundle" >> /notnfs/nighttester/icedtea7-target-testing/openjdk.build-boot/tmp/sun/sun.tools/compile_prop_options
rm -f /notnfs/nighttester/icedtea7-target-testing/generated.build/sun/tools/jar/resources/jar_zh_CN.java
# Adding to compile properties list: ../../../src/share/classes/sun/tools/jar/resources/jar_zh_CN.properties -> /notnfs/nighttester/icedtea7-target-testing/generated.build/sun/tools/jar/resources/jar_zh_CN.java
/bin/echo -e "-compile ../../../src/share/classes/sun/tools/jar/resources/jar_zh_CN.properties /notnfs/nighttester/icedtea7-target-testing/generated.build/sun/tools/jar/resources/jar_zh_CN.java ListResourceBundle" >> /notnfs/nighttester/icedtea7-target-testing/openjdk.build-boot/tmp/sun/sun.tools/compile_prop_options
rm -f /notnfs/nighttester/icedtea7-target-testing/generated.build/sun/tools/jar/resources/jar_zh_TW.java
# Adding to compile properties list: ../../../src/share/classes/sun/tools/jar/resources/jar_zh_TW.properties -> /notnfs/nighttester/icedtea7-target-testing/generated.build/sun/tools/jar/resources/jar_zh_TW.java
/bin/echo -e "-compile ../../../src/share/classes/sun/tools/jar/resources/jar_zh_TW.properties /notnfs/nighttester/icedtea7-target-testing/generated.build/sun/tools/jar/resources/jar_zh_TW.java ListResourceBundle" >> /notnfs/nighttester/icedtea7-target-testing/openjdk.build-boot/tmp/sun/sun.tools/compile_prop_options
rm -f /notnfs/nighttester/icedtea7-target-testing/generated.build/sun/tools/jar/resources/jar_zh_HK.java
# Adding to compile properties list: ../../../src/share/classes/sun/tools/jar/resources/jar_zh_TW.properties -> /notnfs/nighttester/icedtea7-target-testing/generated.build/sun/tools/jar/resources/jar_zh_HK.java
/bin/echo -e "-compile ../../../src/share/classes/sun/tools/jar/resources/jar_zh_TW.properties /notnfs/nighttester/icedtea7-target-testing/generated.build/sun/tools/jar/resources/jar_zh_HK.java ListResourceBundle" >> /notnfs/nighttester/icedtea7-target-testing/openjdk.build-boot/tmp/sun/sun.tools/compile_prop_options
/notnfs/nighttester/icedtea7-target-testing/bootstrap/jdk1.6.0/bin/java -XX:-PrintVMOptions -XX:+UnlockDiagnosticVMOptions -XX:-LogVMOutput -Xmx512m -Xms512m -XX:PermSize=32m -XX:MaxPermSize=160m -jar /notnfs/nighttester/icedtea7-target-testing/openjdk.build-boot/btjars/compileproperties.jar -optionsfile /notnfs/nighttester/icedtea7-target-testing/openjdk.build-boot/tmp/sun/sun.tools/compile_prop_options
parsing: ../../../src/share/classes/sun/tools/jar/resources/jar.properties
inferred package name: sun.tools.jar.resources
wrote: /notnfs/nighttester/icedtea7-target-testing/generated.build/sun/tools/jar/resources/jar.java
parsing: ../../../src/share/classes/sun/tools/jar/resources/jar_de.properties
inferred package name: sun.tools.jar.resources
wrote: /notnfs/nighttester/icedtea7-target-testing/generated.build/sun/tools/jar/resources/jar_de.java
parsing: ../../../src/share/classes/sun/tools/jar/resources/jar_es.properties
inferred package name: sun.tools.jar.resources
wrote: /notnfs/nighttester/icedtea7-target-testing/generated.build/sun/tools/jar/resources/jar_es.java
parsing: ../../../src/share/classes/sun/tools/jar/resources/jar_fr.properties
inferred package name: sun.tools.jar.resources
wrote: /notnfs/nighttester/icedtea7-target-testing/generated.build/sun/tools/jar/resources/jar_fr.java
parsing: ../../../src/share/classes/sun/tools/jar/resources/jar_it.properties
inferred package name: sun.tools.jar.resources
wrote: /notnfs/nighttester/icedtea7-target-testing/generated.build/sun/tools/jar/resources/jar_it.java
parsing: ../../../src/share/classes/sun/tools/jar/resources/jar_ja.properties
inferred package name: sun.tools.jar.resources
wrote: /notnfs/nighttester/icedtea7-target-testing/generated.build/sun/tools/jar/resources/jar_ja.java
parsing: ../../../src/share/classes/sun/tools/jar/resources/jar_ko.properties
inferred package name: sun.tools.jar.resources
wrote: /notnfs/nighttester/icedtea7-target-testing/generated.build/sun/tools/jar/resources/jar_ko.java
parsing: ../../../src/share/classes/sun/tools/jar/resources/jar_pt_BR.properties
inferred package name: sun.tools.jar.resources
wrote: /notnfs/nighttester/icedtea7-target-testing/generated.build/sun/tools/jar/resources/jar_pt_BR.java
parsing: ../../../src/share/classes/sun/tools/jar/resources/jar_sv.properties
inferred package name: sun.tools.jar.resources
wrote: /notnfs/nighttester/icedtea7-target-testing/generated.build/sun/tools/jar/resources/jar_sv.java
parsing: ../../../src/share/classes/sun/tools/jar/resources/jar_zh_CN.properties
inferred package name: sun.tools.jar.resources
wrote: /notnfs/nighttester/icedtea7-target-testing/generated.build/sun/tools/jar/resources/jar_zh_CN.java
parsing: ../../../src/share/classes/sun/tools/jar/resources/jar_zh_TW.properties
inferred package name: sun.tools.jar.resources
wrote: /notnfs/nighttester/icedtea7-target-testing/generated.build/sun/tools/jar/resources/jar_zh_TW.java
parsing: ../../../src/share/classes/sun/tools/jar/resources/jar_zh_TW.properties
inferred package name: sun.tools.jar.resources
wrote: /notnfs/nighttester/icedtea7-target-testing/generated.build/sun/tools/jar/resources/jar_zh_HK.java
# Java sources to be compiled: (listed in file /notnfs/nighttester/icedtea7-target-testing/openjdk.build-boot/tmp/sun/sun.tools/.classes.list)
../../../src/share/classes/sun/tools/jar/CommandLine.java
../../../src/share/classes/sun/tools/jar/JarException.java
../../../src/share/classes/sun/tools/jar/JarImageSource.java
../../../src/share/classes/sun/tools/jar/Main.java
../../../src/share/classes/sun/tools/jar/Manifest.java
../../../src/share/classes/sun/tools/jar/SignatureFile.java
/notnfs/nighttester/icedtea7-target-testing/generated.build/sun/tools/jar/resources/jar.java
/notnfs/nighttester/icedtea7-target-testing/generated.build/sun/tools/jar/resources/jar_de.java
/notnfs/nighttester/icedtea7-target-testing/generated.build/sun/tools/jar/resources/jar_es.java
/notnfs/nighttester/icedtea7-target-testing/generated.build/sun/tools/jar/resources/jar_fr.java
/notnfs/nighttester/icedtea7-target-testing/generated.build/sun/tools/jar/resources/jar_it.java
/notnfs/nighttester/icedtea7-target-testing/generated.build/sun/tools/jar/resources/jar_ja.java
/notnfs/nighttester/icedtea7-target-testing/generated.build/sun/tools/jar/resources/jar_ko.java
/notnfs/nighttester/icedtea7-target-testing/generated.build/sun/tools/jar/resources/jar_pt_BR.java
/notnfs/nighttester/icedtea7-target-testing/generated.build/sun/tools/jar/resources/jar_sv.java
/notnfs/nighttester/icedtea7-target-testing/generated.build/sun/tools/jar/resources/jar_zh_CN.java
/notnfs/nighttester/icedtea7-target-testing/generated.build/sun/tools/jar/resources/jar_zh_HK.java
/notnfs/nighttester/icedtea7-target-testing/generated.build/sun/tools/jar/resources/jar_zh_TW.java
# Running javac:
/notnfs/nighttester/icedtea7-target-testing/bootstrap/jdk1.6.0/bin/javac -J-XX:ThreadStackSize=1664 -J-XX:-PrintVMOptions -J-XX:+UnlockDiagnosticVMOptions -J-XX:-LogVMOutput -J-Xmx512m -J-Xms512m -J-XX:PermSize=32m -J-XX:MaxPermSize=160m -g -source 7 -target 7 -encoding ascii -Xbootclasspath:/notnfs/nighttester/icedtea7-target-testing/openjdk.build-boot/classes -sourcepath /notnfs/nighttester/icedtea7-target-testing/generated.build:../../../src/solaris/classes:../../../src/share/classes -bootclasspath /notnfs/nighttester/icedtea7-target-testing/openjdk.build-boot/classes:/notnfs/nighttester/icedtea7-target-testing/bootstrap/jdk1.6.0/jre/lib/rt.jar -d /notnfs/nighttester/icedtea7-target-testing/openjdk.build-boot/classes @/notnfs/nighttester/icedtea7-target-testing/openjdk.build-boot/tmp/sun/sun.tools/.classes.list
Annotation processing got disabled, since it requires a 1.6 compliant JVM
gmake[5]: Leaving directory `/notnfs/nighttester/icedtea7-target-testing/openjdk-boot/jdk/make/sun/jar'
INFO: ENABLE_FULL_DEBUG_SYMBOLS=1
INFO: /usr/bin/objcopy cmd found so will create .debuginfo files.
INFO: STRIP_POLICY=no_strip
INFO: ZIP_DEBUGINFO_FILES=1
gmake[5]: Entering directory `/notnfs/nighttester/icedtea7-target-testing/openjdk-boot/jdk/make/sun/security'
Begin Processing SUBDIRS: ec other action util krb5 krb5/internal/ccache    jgss pkcs11 jgss/wrapper  smartcardio tools
INFO: ENABLE_FULL_DEBUG_SYMBOLS=1
INFO: /usr/bin/objcopy cmd found so will create .debuginfo files.
INFO: STRIP_POLICY=no_strip
INFO: ZIP_DEBUGINFO_FILES=1
gmake[6]: Entering directory `/notnfs/nighttester/icedtea7-target-testing/openjdk-boot/jdk/make/sun/security/ec'
# Java sources to be compiled: (listed in file /notnfs/nighttester/icedtea7-target-testing/openjdk.build-boot/tmp/sun/sun.security.ec/.classes.list)
../../../../src/share/classes/sun/security/ec/ECDHKeyAgreement.java
../../../../src/share/classes/sun/security/ec/ECDSASignature.java
../../../../src/share/classes/sun/security/ec/ECKeyPairGenerator.java
../../../../src/share/classes/sun/security/ec/SunEC.java
../../../../src/share/classes/sun/security/ec/SunECEntries.java
# Running javac:
/notnfs/nighttester/icedtea7-target-testing/bootstrap/jdk1.6.0/bin/javac -J-XX:ThreadStackSize=1664 -J-XX:-PrintVMOptions -J-XX:+UnlockDiagnosticVMOptions -J-XX:-LogVMOutput -J-Xmx512m -J-Xms512m -J-XX:PermSize=32m -J-XX:MaxPermSize=160m -g -source 7 -target 7 -encoding ascii -Xbootclasspath:/notnfs/nighttester/icedtea7-target-testing/openjdk.build-boot/classes -sourcepath /notnfs/nighttester/icedtea7-target-testing/generated.build:../../../../src/solaris/classes:../../../../src/share/classes -bootclasspath /notnfs/nighttester/icedtea7-target-testing/openjdk.build-boot/tmp/sun/sun.security.ec/classes:/notnfs/nighttester/icedtea7-target-testing/bootstrap/jdk1.6.0/jre/lib/rt.jar -d /notnfs/nighttester/icedtea7-target-testing/openjdk.build-boot/tmp/sun/sun.security.ec/classes @/notnfs/nighttester/icedtea7-target-testing/openjdk.build-boot/tmp/sun/sun.security.ec/.classes.list
Annotation processing got disabled, since it requires a 1.6 compliant JVM
/bin/mkdir -p /notnfs/nighttester/icedtea7-target-testing/openjdk.build-boot/tmp/sun/sun.security.ec/obj64
rm -f /notnfs/nighttester/icedtea7-target-testing/openjdk.build-boot/tmp/sun/sun.security.ec/obj64/.class.headers.amd64
# Running javah:
/notnfs/nighttester/icedtea7-target-testing/bootstrap/jdk1.6.0/bin/javah -bootclasspath "/notnfs/nighttester/icedtea7-target-testing/openjdk.build-boot/tmp/sun/sun.security.ec/classes:/notnfs/nighttester/icedtea7-target-testing/openjdk.build-boot/classes" -d /notnfs/nighttester/icedtea7-target-testing/openjdk.build-boot/tmp/sun/sun.security.ec/CClassHeaders/ \
	sun.security.ec.ECDHKeyAgreement sun.security.ec.ECDSASignature sun.security.ec.ECKeyPairGenerator   
Building lib:/notnfs/nighttester/icedtea7-target-testing/openjdk.build-boot/lib/amd64/libsunec.so
Begin parallel compiles: /notnfs/nighttester/icedtea7-target-testing/openjdk-boot/jdk/make/sun/security/ec
INFO: ENABLE_FULL_DEBUG_SYMBOLS=1
INFO: /usr/bin/objcopy cmd found so will create .debuginfo files.
INFO: STRIP_POLICY=no_strip
INFO: ZIP_DEBUGINFO_FILES=1
gmake[7]: Entering directory `/notnfs/nighttester/icedtea7-target-testing/openjdk-boot/jdk/make/sun/security/ec'
/usr/bin/g++  -O2 -fPIC -DCC_NOEX -W -Wall  -Wno-unused -Wno-parentheses -fno-omit-frame-pointer -D_LITTLE_ENDIAN -g   -DNDEBUG -DARCH='"amd64"' -Damd64 -DLINUX -DRELEASE='"1.7.0_60"' -D_LARGEFILE64_SOURCE -D_GNU_SOURCE -D_REENTRANT -D_LP64=1 -DUSE_PTHREADS -I. -I/notnfs/nighttester/icedtea7-target-testing/openjdk.build-boot/tmp/sun/sun.security.ec/CClassHeaders -I../../../../src/solaris/javavm/export -I../../../../src/share/javavm/export -I/usr/include/nss3 -I/usr/include/nspr4   -lfreebl -DSYSTEM_NSS -DNSS_ENABLE_ECC -I../../../../src/share/native/common -I../../../../src/solaris/native/common -I../../../../src/share/native/sun/security/ec -I../../../../src/solaris/native/sun/security/ec    -c -o /notnfs/nighttester/icedtea7-target-testing/openjdk.build-boot/tmp/sun/sun.security.ec/obj64/ECC_JNI.o  ../../../../src/share/native/sun/security/ec/ECC_JNI.cpp
gmake[7]: Leaving directory `/notnfs/nighttester/icedtea7-target-testing/openjdk-boot/jdk/make/sun/security/ec'
Done with parallel compiles: /notnfs/nighttester/icedtea7-target-testing/openjdk-boot/jdk/make/sun/security/ec
STATS: LIBRARY=sunec, PRODUCT=sun, OPTIMIZATION_LEVEL=LOWER
Rebuilding /notnfs/nighttester/icedtea7-target-testing/openjdk.build-boot/lib/amd64/libsunec.so because of /notnfs/nighttester/icedtea7-target-testing/openjdk.build-boot/tmp/sun/sun.security.ec/obj64/.files_compiled mapfile-vers
/usr/bin/g++  -O2 -fPIC -DCC_NOEX -W -Wall  -Wno-unused -Wno-parentheses -fno-omit-frame-pointer -D_LITTLE_ENDIAN -g   -DNDEBUG -DARCH='"amd64"' -Damd64 -DLINUX -DRELEASE='"1.7.0_60"' -D_LARGEFILE64_SOURCE -D_GNU_SOURCE -D_REENTRANT -D_LP64=1 -DUSE_PTHREADS -I. -I/notnfs/nighttester/icedtea7-target-testing/openjdk.build-boot/tmp/sun/sun.security.ec/CClassHeaders -I../../../../src/solaris/javavm/export -I../../../../src/share/javavm/export -I/usr/include/nss3 -I/usr/include/nspr4   -lfreebl -DSYSTEM_NSS -DNSS_ENABLE_ECC -I../../../../src/share/native/common -I../../../../src/solaris/native/common -I../../../../src/share/native/sun/security/ec -I../../../../src/solaris/native/sun/security/ec   -Xlinker -O1 -Xlinker -version-script=mapfile-vers  -Wl,--hash-style=both -Xlinker -z -Xlinker defs -L/notnfs/nighttester/icedtea7-target-testing/openjdk.build-boot/lib/amd64 -Wl,-soname=libsunec.so   -shared -o /notnfs/nighttester/icedtea7-target-testing/openjdk.build-boot/lib/amd64/libsunec.so    /notnfs/nighttester/icedtea7-target-testing/openjdk.build-boot/tmp/sun/sun.security.ec/obj64/ECC_JNI.o -lstdc++ -lfreebl3 -lnssdbm3 -lsoftokn3 -lnssutil3 -lplds4 -lplc4 -lnspr4 -lpthread -ldl    -lc
/notnfs/nighttester/icedtea7-target-testing/openjdk.build-boot/tmp/sun/sun.security.ec/obj64/ECC_JNI.o: In function `FreeECParams':
/notnfs/nighttester/icedtea7-target-testing/openjdk-boot/jdk/make/sun/security/ec/../../../../src/share/native/sun/security/ec/ECC_JNI.cpp:55: undefined reference to `SECITEM_FreeItem'
/notnfs/nighttester/icedtea7-target-testing/openjdk-boot/jdk/make/sun/security/ec/../../../../src/share/native/sun/security/ec/ECC_JNI.cpp:56: undefined reference to `SECITEM_FreeItem'
/notnfs/nighttester/icedtea7-target-testing/openjdk-boot/jdk/make/sun/security/ec/../../../../src/share/native/sun/security/ec/ECC_JNI.cpp:57: undefined reference to `SECITEM_FreeItem'
/notnfs/nighttester/icedtea7-target-testing/openjdk-boot/jdk/make/sun/security/ec/../../../../src/share/native/sun/security/ec/ECC_JNI.cpp:58: undefined reference to `SECITEM_FreeItem'
/notnfs/nighttester/icedtea7-target-testing/openjdk-boot/jdk/make/sun/security/ec/../../../../src/share/native/sun/security/ec/ECC_JNI.cpp:59: undefined reference to `SECITEM_FreeItem'
/notnfs/nighttester/icedtea7-target-testing/openjdk.build-boot/tmp/sun/sun.security.ec/obj64/ECC_JNI.o:/notnfs/nighttester/icedtea7-target-testing/openjdk-boot/jdk/make/sun/security/ec/../../../../src/share/native/sun/security/ec/ECC_JNI.cpp:60: more undefined references to `SECITEM_FreeItem' follow
/notnfs/nighttester/icedtea7-target-testing/openjdk.build-boot/tmp/sun/sun.security.ec/obj64/ECC_JNI.o: In function `Java_sun_security_ec_ECKeyPairGenerator_generateECKeyPair':
/notnfs/nighttester/icedtea7-target-testing/openjdk-boot/jdk/make/sun/security/ec/../../../../src/share/native/sun/security/ec/ECC_JNI.cpp:90: undefined reference to `EC_DecodeParams'
/notnfs/nighttester/icedtea7-target-testing/openjdk-boot/jdk/make/sun/security/ec/../../../../src/share/native/sun/security/ec/ECC_JNI.cpp:102: undefined reference to `EC_NewKeyFromSeed'
/notnfs/nighttester/icedtea7-target-testing/openjdk-boot/jdk/make/sun/security/ec/../../../../src/share/native/sun/security/ec/ECC_JNI.cpp:131: undefined reference to `SECITEM_FreeItem'
/notnfs/nighttester/icedtea7-target-testing/openjdk.build-boot/tmp/sun/sun.security.ec/obj64/ECC_JNI.o: In function `Java_sun_security_ec_ECKeyPairGenerator_getEncodedBytes':
/notnfs/nighttester/icedtea7-target-testing/openjdk-boot/jdk/make/sun/security/ec/../../../../src/share/native/sun/security/ec/ECC_JNI.cpp:158: undefined reference to `SECITEM_FreeItem'
/notnfs/nighttester/icedtea7-target-testing/openjdk.build-boot/tmp/sun/sun.security.ec/obj64/ECC_JNI.o: In function `Java_sun_security_ec_ECDSASignature_signDigest':
/notnfs/nighttester/icedtea7-target-testing/openjdk-boot/jdk/make/sun/security/ec/../../../../src/share/native/sun/security/ec/ECC_JNI.cpp:200: undefined reference to `EC_DecodeParams'
/notnfs/nighttester/icedtea7-target-testing/openjdk-boot/jdk/make/sun/security/ec/../../../../src/share/native/sun/security/ec/ECC_JNI.cpp:222: undefined reference to `ECDSA_SignDigestWithSeed'
/notnfs/nighttester/icedtea7-target-testing/openjdk.build-boot/tmp/sun/sun.security.ec/obj64/ECC_JNI.o: In function `Java_sun_security_ec_ECDSASignature_verifySignedDigest':
/notnfs/nighttester/icedtea7-target-testing/openjdk-boot/jdk/make/sun/security/ec/../../../../src/share/native/sun/security/ec/ECC_JNI.cpp:299: undefined reference to `EC_DecodeParams'
/notnfs/nighttester/icedtea7-target-testing/openjdk-boot/jdk/make/sun/security/ec/../../../../src/share/native/sun/security/ec/ECC_JNI.cpp:309: undefined reference to `ECDSA_VerifyDigest'
/notnfs/nighttester/icedtea7-target-testing/openjdk.build-boot/tmp/sun/sun.security.ec/obj64/ECC_JNI.o: In function `Java_sun_security_ec_ECDHKeyAgreement_deriveKey':
/notnfs/nighttester/icedtea7-target-testing/openjdk-boot/jdk/make/sun/security/ec/../../../../src/share/native/sun/security/ec/ECC_JNI.cpp:370: undefined reference to `EC_DecodeParams'
/notnfs/nighttester/icedtea7-target-testing/openjdk-boot/jdk/make/sun/security/ec/../../../../src/share/native/sun/security/ec/ECC_JNI.cpp:381: undefined reference to `ECDH_Derive'
/notnfs/nighttester/icedtea7-target-testing/openjdk-boot/jdk/make/sun/security/ec/../../../../src/share/native/sun/security/ec/ECC_JNI.cpp:395: undefined reference to `SECITEM_FreeItem'
collect2: error: ld returned 1 exit status
gmake[6]: *** [/notnfs/nighttester/icedtea7-target-testing/openjdk.build-boot/lib/amd64/libsunec.so] Error 1
gmake[6]: Leaving directory `/notnfs/nighttester/icedtea7-target-testing/openjdk-boot/jdk/make/sun/security/ec'
gmake[5]: *** [all] Error 1
gmake[5]: Leaving directory `/notnfs/nighttester/icedtea7-target-testing/openjdk-boot/jdk/make/sun/security'
gmake[4]: *** [all] Error 1
gmake[4]: Leaving directory `/notnfs/nighttester/icedtea7-target-testing/openjdk-boot/jdk/make/sun'
gmake[3]: *** [all] Error 1
gmake[3]: Leaving directory `/notnfs/nighttester/icedtea7-target-testing/openjdk-boot/jdk/make'
gmake[2]: *** [jdk-build] Error 2
gmake[2]: Leaving directory `/notnfs/nighttester/icedtea7-target-testing/openjdk-boot'
gmake[1]: *** [build_product_image] Error 2
gmake[1]: Leaving directory `/notnfs/nighttester/icedtea7-target-testing/openjdk-boot'
make: *** [stamps/icedtea-boot.stamp] Error 2
+ exit 1
Build step 'Execute shell' marked build as failure


More information about the icedtea-test mailing list