Build failed in Jenkins: IcedTea6hgTargetTesting #1400

Hudson Admin gnu.andrew at redhat.com
Sat Jan 24 07:14:36 UTC 2015


See <http://toadeater.yyz.redhat.com:8080/job/IcedTea6hgTargetTesting/1400/>

------------------------------------------
[...truncated 1569 lines...]
Hunk #2 succeeded at 139 (offset 16 lines).
Hunk #3 succeeded at 189 (offset 16 lines).
patching file openjdk/jdk/test/java/awt/Paint/PgramUserBoundsTest.java
Checking patches/openjdk/mutter.patch
Applying patches/openjdk/mutter.patch
patching file openjdk/jdk/src/solaris/classes/sun/awt/X11/XDecoratedPeer.java
Hunk #1 succeeded at 767 (offset 46 lines).
Hunk #2 succeeded at 777 with fuzz 1 (offset 46 lines).
patching file openjdk/jdk/src/solaris/classes/sun/awt/X11/XWM.java
Hunk #1 succeeded at 98 (offset -3 lines).
Hunk #2 succeeded at 126 (offset -3 lines).
Hunk #3 succeeded at 572 (offset 3 lines).
Hunk #4 succeeded at 753 (offset 9 lines).
Hunk #5 succeeded at 1054 (offset 7 lines).
Hunk #6 succeeded at 1392 (offset 19 lines).
Hunk #7 succeeded at 1587 with fuzz 1 (offset 19 lines).
patching file openjdk/jdk/test/java/awt/WMSpecificTests/Mutter/MutterMaximizeTest.java
patching file openjdk/jdk/test/java/awt/regtesthelpers/Util.java
Checking patches/openjdk/7036148-npe-null-jmenu-name.patch
Applying patches/openjdk/7036148-npe-null-jmenu-name.patch
patching file openjdk/jdk/src/share/classes/sun/swing/SwingUtilities2.java
Hunk #1 succeeded at 238 (offset -32 lines).
patching file openjdk/jdk/test/javax/swing/JMenuItem/7036148/bug7036148.java
Checking patches/jtreg-ChangeDir.patch
Applying patches/jtreg-ChangeDir.patch
patching file openjdk/jdk/test/tools/jar/ChangeDir.java
Checking patches/jtreg-TempBuffer.patch
Applying patches/jtreg-TempBuffer.patch
patching file openjdk/jdk/test/sun/nio/ch/TempBuffer.java
Checking patches/jtreg-EncodedMultiByteChar.patch
Applying patches/jtreg-EncodedMultiByteChar.patch
patching file openjdk/jdk/test/sun/net/www/protocol/file/EncodedMultiByteChar.java
Checking patches/jtreg-FileLoaderTest.patch
Applying patches/jtreg-FileLoaderTest.patch
patching file openjdk/jdk/test/sun/misc/URLClassPath/FileLoaderTest.java
Checking patches/jtreg-FileMap.patch
Applying patches/jtreg-FileMap.patch
patching file openjdk/jdk/test/sun/net/www/protocol/file/FileMap.java
Checking patches/jtreg-ChannelsWrite.patch
Applying patches/jtreg-ChannelsWrite.patch
patching file openjdk/jdk/test/java/nio/channels/Channels/Write.java
Checking patches/jtreg-bug7036148-test.patch
Applying patches/jtreg-bug7036148-test.patch
patching file openjdk/jdk/test/javax/swing/JMenuItem/7036148/bug7036148.java
Checking patches/openjdk/6818312-com.sun.awt.SecurityWarning.getSize.patch
Applying patches/openjdk/6818312-com.sun.awt.SecurityWarning.getSize.patch
patching file openjdk/jdk/test/com/sun/awt/SecurityWarning/GetSizeShouldNotReturnZero.java
Checking patches/jtreg-MappedByteBuffer-Basic.patch
Applying patches/jtreg-MappedByteBuffer-Basic.patch
patching file openjdk/jdk/test/java/nio/MappedByteBuffer/Basic.java
Checking patches/openjdk/7008106-WindowOpacity.patch
Applying patches/openjdk/7008106-WindowOpacity.patch
patching file openjdk/jdk/test/com/sun/awt/Translucency/WindowOpacity.java
Checking patches/openjdk/6699843-IllegalArgumentException_drawString.patch
Applying patches/openjdk/6699843-IllegalArgumentException_drawString.patch
patching file openjdk/jdk/src/share/classes/sun/java2d/SunGraphics2D.java
patching file openjdk/jdk/test/java/awt/Graphics2D/DrawString/EmptyAttrString.java
Checking patches/openjdk/6918065-Crash_in_Java2D_blit_loop.patch
Applying patches/openjdk/6918065-Crash_in_Java2D_blit_loop.patch
patching file openjdk/jdk/src/share/classes/java/awt/AlphaComposite.java
patching file openjdk/jdk/test/java/awt/AlphaComposite/TestAlphaCompositeForNaN.java
Checking patches/openjdk/6623219-Font_canDisplayUpTo_does_not_work.patch
Applying patches/openjdk/6623219-Font_canDisplayUpTo_does_not_work.patch
patching file openjdk/jdk/src/share/classes/java/awt/Font.java
Hunk #1 succeeded at 1997 (offset 12 lines).
Hunk #2 succeeded at 2035 (offset 12 lines).
Hunk #3 succeeded at 2070 (offset 12 lines).
patching file openjdk/jdk/test/java/awt/FontClass/SurrogateTest/SupplementaryCanDisplayUpToTest.java
Checking patches/openjdk/6783910-java_awt_Color_brighter_darker_fix.patch
Applying patches/openjdk/6783910-java_awt_Color_brighter_darker_fix.patch
patching file openjdk/jdk/src/share/classes/java/awt/Color.java
Hunk #1 succeeded at 614 (offset 3 lines).
Hunk #2 succeeded at 630 (offset 3 lines).
Hunk #3 succeeded at 639 (offset 3 lines).
Hunk #4 succeeded at 647 (offset 3 lines).
Hunk #5 succeeded at 657 (offset 3 lines).
patching file openjdk/jdk/test/java/awt/Color/OpacityChange/OpacityChange.java
Checking patches/openjdk/6785424-SecurityException_locating_physical_fonts.patch
Applying patches/openjdk/6785424-SecurityException_locating_physical_fonts.patch
patching file openjdk/jdk/src/share/classes/sun/font/FontManager.java
Hunk #1 succeeded at 1586 (offset -15 lines).
patching file openjdk/jdk/test/java/awt/FontClass/FontAccess.java
Checking patches/openjdk/6679308-Poor_text_rendering_on_translucent_image.patch
Applying patches/openjdk/6679308-Poor_text_rendering_on_translucent_image.patch
patching file openjdk/jdk/src/share/native/sun/java2d/loops/AlphaMacros.h
patching file openjdk/jdk/src/share/native/sun/java2d/loops/ByteGray.h
patching file openjdk/jdk/src/share/native/sun/java2d/loops/FourByteAbgr.h
patching file openjdk/jdk/src/share/native/sun/java2d/loops/FourByteAbgrPre.h
patching file openjdk/jdk/src/share/native/sun/java2d/loops/Index12Gray.h
patching file openjdk/jdk/src/share/native/sun/java2d/loops/Index8Gray.h
patching file openjdk/jdk/src/share/native/sun/java2d/loops/IntArgb.h
patching file openjdk/jdk/src/share/native/sun/java2d/loops/IntArgbBm.h
patching file openjdk/jdk/src/share/native/sun/java2d/loops/IntArgbPre.h
patching file openjdk/jdk/src/share/native/sun/java2d/loops/IntBgr.h
patching file openjdk/jdk/src/share/native/sun/java2d/loops/IntRgb.h
patching file openjdk/jdk/src/share/native/sun/java2d/loops/IntRgbx.h
patching file openjdk/jdk/src/share/native/sun/java2d/loops/LoopMacros.h
Hunk #1 succeeded at 1683 (offset 73 lines).
Hunk #2 succeeded at 1870 (offset 73 lines).
patching file openjdk/jdk/src/share/native/sun/java2d/loops/ThreeByteBgr.h
patching file openjdk/jdk/src/share/native/sun/java2d/loops/Ushort4444Argb.h
patching file openjdk/jdk/src/share/native/sun/java2d/loops/Ushort555Rgb.h
patching file openjdk/jdk/src/share/native/sun/java2d/loops/Ushort555Rgbx.h
patching file openjdk/jdk/src/share/native/sun/java2d/loops/Ushort565Rgb.h
patching file openjdk/jdk/src/share/native/sun/java2d/loops/UshortGray.h
patching file openjdk/jdk/src/solaris/native/sun/java2d/loops/vis_FourByteAbgr.c
patching file openjdk/jdk/src/solaris/native/sun/java2d/loops/vis_FourByteAbgrPre.c
patching file openjdk/jdk/src/solaris/native/sun/java2d/loops/vis_IntArgb.c
patching file openjdk/jdk/src/solaris/native/sun/java2d/loops/vis_IntArgbPre.c
patching file openjdk/jdk/test/java/awt/Graphics2D/DrawString/AlphaSurfaceText.java
Checking patches/openjdk/6842838-64-bit_failure_in_handling_invalid_manifest.patch
Applying patches/openjdk/6842838-64-bit_failure_in_handling_invalid_manifest.patch
patching file openjdk/jdk/src/share/bin/parse_manifest.c
Hunk #1 succeeded at 77 (offset 18 lines).
patching file openjdk/jdk/test/tools/launcher/6842838/CreateBadJar.java
patching file openjdk/jdk/test/tools/launcher/6842838/Test6842838.sh
Checking patches/openjdk/6882768-test_for_6842838_is_broken.patch
Applying patches/openjdk/6882768-test_for_6842838_is_broken.patch
patching file openjdk/jdk/test/tools/launcher/6842838/Test6842838.sh
Checking patches/hotspot/hs23/pr639-broken_shark_build.patch
Applying patches/hotspot/hs23/pr639-broken_shark_build.patch
patching file openjdk/hotspot/make/linux/makefiles/launcher.make
patching file openjdk/hotspot/src/share/vm/ci/ciTypeFlow.cpp
Checking patches/powerpc-stacksize.patch
Applying patches/powerpc-stacksize.patch
patching file openjdk/hotspot/src/os_cpu/linux_zero/vm/globals_linux_zero.hpp
patching file openjdk/corba/make/common/shared/Defs-java.gmk
patching file openjdk/jdk/make/common/shared/Defs-java.gmk
Checking patches/openjdk/6711682-JCheckBox_in_JTable_does_not_respond_to_click.patch
Applying patches/openjdk/6711682-JCheckBox_in_JTable_does_not_respond_to_click.patch
patching file openjdk/jdk/src/share/classes/javax/swing/plaf/basic/BasicButtonListener.java
patching file openjdk/jdk/test/javax/swing/AbstractButton/6711682/bug6711682.java
Checking patches/openjdk/6758179-D3D_AlphaComposite_is_applied_incorrectly.patch
Applying patches/openjdk/6758179-D3D_AlphaComposite_is_applied_incorrectly.patch
patching file openjdk/jdk/src/windows/native/sun/java2d/d3d/D3DBlitLoops.cpp
Hunk #1 succeeded at 251 (offset -1 lines).
patching file openjdk/jdk/test/sun/java2d/DirectX/OpaqueImageToSurfaceBlitTest/OpaqueImageToSurfaceBlitTest.java
Checking patches/jtreg-ConstructDeflaterInput-fix.patch
Applying patches/jtreg-ConstructDeflaterInput-fix.patch
patching file openjdk/jdk/test/java/util/zip/ConstructDeflaterInput.java
Checking patches/openjdk/6613904-GroupLayout_createParallelGroup_null_arg.patch
Applying patches/openjdk/6613904-GroupLayout_createParallelGroup_null_arg.patch
patching file openjdk/jdk/src/share/classes/javax/swing/GroupLayout.java
patching file openjdk/jdk/test/javax/swing/GroupLayout/6613904/bug6613904.java
Checking patches/openjdk/7049339-anyblit-broken.patch
Applying patches/openjdk/7049339-anyblit-broken.patch
patching file openjdk/jdk/src/share/classes/sun/java2d/loops/Blit.java
patching file openjdk/jdk/test/sun/java2d/loops/Bug7049339.java
Checking patches/openjdk/4917091-javac_rejects_array_over_128_in_length.patch
Applying patches/openjdk/4917091-javac_rejects_array_over_128_in_length.patch
patching file openjdk/langtools/src/share/classes/com/sun/tools/javac/jvm/Gen.java
patching file openjdk/langtools/test/tools/javac/4917091/Test255.java
patching file openjdk/langtools/test/tools/javac/4917091/Test256a.java
patching file openjdk/langtools/test/tools/javac/4917091/Test256a.out
patching file openjdk/langtools/test/tools/javac/4917091/Test256b.java
patching file openjdk/langtools/test/tools/javac/4917091/Test256b.out
Checking patches/openjdk/6390045-error_cannot_access_java_lang_void.patch
Applying patches/openjdk/6390045-error_cannot_access_java_lang_void.patch
patching file openjdk/langtools/src/share/classes/com/sun/tools/javac/code/Symtab.java
Hunk #1 succeeded at 441 (offset 1 line).
patching file openjdk/langtools/test/tools/javac/6390045/T6390045a.java
patching file openjdk/langtools/test/tools/javac/6390045/T6390045b.java
Checking patches/openjdk/6752638-preferLocaleFonts_throws_NPE.patch
Applying patches/openjdk/6752638-preferLocaleFonts_throws_NPE.patch
patching file openjdk/jdk/src/share/classes/java/awt/GraphicsEnvironment.java
Hunk #1 succeeded at 355 (offset -1 lines).
Hunk #2 succeeded at 378 (offset -1 lines).
patching file openjdk/jdk/test/java/awt/GraphicsEnvironment/PreferLocaleFonts.java
Checking patches/openjdk/5047314-Collator_compare_runs_indefinitely.patch
Applying patches/openjdk/5047314-Collator_compare_runs_indefinitely.patch
patching file openjdk/jdk/src/share/classes/java/text/CollationElementIterator.java
patching file openjdk/jdk/test/java/text/Collator/Bug5047314.java
Checking patches/openjdk/6934356-Vector_writeObject_serialization_DL.patch
Applying patches/openjdk/6934356-Vector_writeObject_serialization_DL.patch
patching file openjdk/jdk/src/share/classes/java/util/Vector.java
patching file openjdk/jdk/test/java/util/Vector/SerializationDeadlock.java
patching file openjdk/jdk/test/java/util/Vector/SimpleSerialization.java
Checking patches/openjdk/7036582-Improve_test_coverage_of_BigDecimal.patch
Applying patches/openjdk/7036582-Improve_test_coverage_of_BigDecimal.patch
patching file openjdk/jdk/test/java/math/BigDecimal/DivideMcTests.java
patching file openjdk/jdk/test/java/math/BigDecimal/FloatDoubleValueTests.java
patching file openjdk/jdk/test/java/math/BigDecimal/RangeTests.java
patching file openjdk/jdk/test/java/math/BigDecimal/StrippingZerosTest.java
patching file openjdk/jdk/test/java/math/BigDecimal/ToPlainStringTests.java
Hunk #1 succeeded at 25 with fuzz 2.
Hunk #2 succeeded at 64 (offset 2 lines).
Hunk #3 succeeded at 82 (offset 2 lines).
Checking patches/openjdk/6806261-BigDecimal_longValueExact_throws_NPE.patch
Applying patches/openjdk/6806261-BigDecimal_longValueExact_throws_NPE.patch
patching file openjdk/jdk/test/java/math/BigDecimal/EqualsTests.java
patching file openjdk/jdk/test/java/math/BigDecimal/LongValueExactTests.java
patching file openjdk/jdk/test/java/math/BigDecimal/PrecisionTests.java
patching file openjdk/jdk/test/java/math/BigInteger/CompareToTests.java
Checking patches/openjdk/6371401-BigInteger.shift_throws_StackOverflowError.patch
Applying patches/openjdk/6371401-BigInteger.shift_throws_StackOverflowError.patch
patching file openjdk/jdk/src/share/classes/java/math/BigInteger.java
Hunk #1 succeeded at 2045 (offset -6 lines).
Hunk #2 succeeded at 2054 (offset -6 lines).
Hunk #3 succeeded at 2098 (offset -6 lines).
patching file openjdk/jdk/test/java/math/BigInteger/ExtremeShiftingTests.java
Checking patches/openjdk/6826104-npe_on_app_and_toolkit_modal_dialog_click.patch
Applying patches/openjdk/6826104-npe_on_app_and_toolkit_modal_dialog_click.patch
patching file openjdk/jdk/src/solaris/classes/sun/awt/X11/XWindowPeer.java
Checking patches/openjdk/5082756-ImageIO_plugins_metadata_boolean_attributes.patch
Applying patches/openjdk/5082756-ImageIO_plugins_metadata_boolean_attributes.patch
patching file openjdk/jdk/src/share/classes/com/sun/imageio/plugins/gif/GIFImageMetadata.java
Hunk #1 succeeded at 155 (offset 2 lines).
Hunk #2 succeeded at 187 (offset 2 lines).
patching file openjdk/jdk/src/share/classes/com/sun/imageio/plugins/gif/GIFMetadata.java
patching file openjdk/jdk/src/share/classes/com/sun/imageio/plugins/gif/GIFStreamMetadata.java
Hunk #1 succeeded at 204 (offset 2 lines).
patching file openjdk/jdk/src/share/classes/com/sun/imageio/plugins/jpeg/JPEGMetadata.java
patching file openjdk/jdk/src/share/classes/com/sun/imageio/plugins/png/PNGMetadata.java
Hunk #1 succeeded at 595 (offset -5 lines).
Hunk #2 succeeded at 827 (offset -5 lines).
Hunk #3 succeeded at 889 (offset -5 lines).
Hunk #4 succeeded at 1157 (offset -5 lines).
patching file openjdk/jdk/src/share/classes/javax/imageio/metadata/IIOMetadataFormat.java
patching file openjdk/jdk/test/javax/imageio/metadata/BooleanAttributes.java
patching file openjdk/jdk/test/javax/imageio/plugins/png/ITXtTest.java
Checking patches/openjdk/6296893-BMP_Writer_handles_TopDown_prop_incorrectly.patch
Applying patches/openjdk/6296893-BMP_Writer_handles_TopDown_prop_incorrectly.patch
patching file openjdk/jdk/src/share/classes/com/sun/imageio/plugins/bmp/BMPImageWriter.java
patching file openjdk/jdk/test/javax/imageio/plugins/bmp/TopDownTest.java
Checking patches/openjdk/7103610-_NET_WM_PID_and_WM_CLIENT_MACHINE_are_not_set.patch
Applying patches/openjdk/7103610-_NET_WM_PID_and_WM_CLIENT_MACHINE_are_not_set.patch
patching file openjdk/jdk/make/sun/xawt/mapfile-vers
Hunk #1 succeeded at 303 (offset -19 lines).
patching file openjdk/jdk/src/solaris/classes/sun/awt/X11/XWindowPeer.java
Hunk #1 succeeded at 199 (offset -9 lines).
patching file openjdk/jdk/src/solaris/native/sun/xawt/XToolkit.c
Hunk #1 succeeded at 46 with fuzz 2 (offset -1 lines).
Hunk #2 succeeded at 916 with fuzz 2 (offset -173 lines).
Checking patches/openjdk/6706974-krb5_test_infrastructure.patch
1 out of 1 hunk FAILED
1 out of 1 hunk FAILED
1 out of 1 hunk FAILED
1 out of 1 hunk FAILED
1 out of 1 hunk FAILED
1 out of 1 hunk FAILED
1 out of 1 hunk FAILED
1 out of 1 hunk FAILED
1 out of 1 hunk FAILED
ERROR patch patches/openjdk/6706974-krb5_test_infrastructure.patch FAILED!
WARNING make clean-patch before retrying a fix
make: *** [stamps/patch.stamp] Error 2
+ exit 1
Build step 'Execute shell' marked build as failure
No JDK named ‘(Default)’ found


More information about the icedtea-test mailing list