Build failed in Jenkins: IcedTea7TargetTesting #2268
Hudson Admin
gnu.andrew at redhat.com
Fri Apr 15 23:14:06 UTC 2016
See <http://toadeater.yyz.redhat.com:8080/job/IcedTea7TargetTesting/2268/changes>
Changes:
[Andrew John Hughes <gnu_andrew at member.fsf.org>] PR2686: Add generated Fedora & Gentoo font configurations for bootstrap stage
2015-10-22 Andrew John Hughes <gnu.andrew at member.fsf.org>
PR2686: Add generated Fedora & Gentoo font
configurations for bootstrap stage
* generated/fontconfig/fontconfig.Fedora.bfc,
* generated/fontconfig/fontconfig.Ubuntu.bfc:
Updated.
* generated/fontconfig/fontconfig.Fedora.10.bfc
* generated/fontconfig/fontconfig.Fedora.11.bfc
* generated/fontconfig/fontconfig.Fedora.12.bfc
* generated/fontconfig/fontconfig.Fedora.9.bfc
* generated/fontconfig/fontconfig.Gentoo.bfc:
Added.
[Andrew John Hughes <gnu_andrew at member.fsf.org>] PR2557, G390663: Update Gentoo font configuration and allow font directory to be specified
2015-10-21 Andrew John Hughes <gnu.andrew at member.fsf.org>
PR2557, G390663: Update Gentoo font configuration
and allow font directory to be specified
* Makefile.am:
(clean-fonts): Remove linux.fontconfig.Gentoo.properties
2015-07-22 Andrew John Hughes <gnu_andrew at member.fsf.org>
PR2557, G390663: Update Gentoo font configuration
and allow font directory to be specified
* INSTALL: Document --with-fonts-dir.
* Makefile.am:
(fonts): Copy the generated Gentoo
font properties file into the OpenJDK
tree.
* acinclude.m4:
(IT_WITH_FONTS_DIR): Allow the user
to specify where the fonts are stored.
* configure.ac: Invoke IT_WITH_FONTS_DIR
and generate linux.fontconfig.Gentoo.properties
* linux.fontconfig.Gentoo.properties.in:
Template fontconfig file for Gentoo copied from
the main Portage tree.
* patches/fonts-gentoo.patch:
Remove outdated copy of
linux.fontconfig.Gentoo.properties from patch.
[Andrew John Hughes <gnu_andrew at member.fsf.org>] PR2557: Forwardport Gentoo font configuration support
2010-08-02 Andrew John Hughes <ahughes at redhat.com>
PR2557: Forwardport Gentoo font configuration support
* Makefile.am: Add patch below.
* patches/fonts-gentoo.patch:
Add a font configuration for Gentoo
(currently a copy of Fedora's).
[Andrew John Hughes <gnu_andrew at member.fsf.org>] PR2557: Forwardport Fedora font configuration support
2015-10-21 Andrew John Hughes <gnu.andrew at member.fsf.org>
PR2557: Forwardport Fedora font configuration support
* Makefile.am:
Add alias for stamps/fonts.stamp
(OPENJDK_TREE): Add stamps/fonts.stamp
(.PHONY): Add clean-fonts.
(clean-extract-openjdk): Depend on clean-fonts.
(clean-fonts): Add reversal for fonts target.
2010-11-10 Jiri Vanek <jvanek at redhat.com>
* Makefile.am:
(FONTCONFIG_PATH): Added path to fontconfig files.
(ICEDTEA_PATCHES): Add f14-fonts.patch.
(fonts): Added cloning of fontconfig.Fedora
to Fedora.12,11,10,9.
* patches/f14-fonts.patch
Updated font configurations for Fedora 9-14
Add additional fontconfig files to Makefile.
[Andrew John Hughes <gnu_andrew at member.fsf.org>] Add 2.6.5 release notes.
2016-04-14 Andrew John Hughes <gnu.andrew at member.fsf.org>
* NEWS: Add 2.6.5 release notes.
------------------------------------------
[...truncated 528006 lines...]
.
Probe hotspot.jni.NewGlobalRef not found.
.
Probe hotspot.jni.NewGlobalRef.return not found.
.
Probe hotspot.jni.NewIntArray not found.
.
Probe hotspot.jni.NewIntArray.return not found.
.
Probe hotspot.jni.NewLocalRef not found.
.
Probe hotspot.jni.NewLocalRef.return not found.
.
Probe hotspot.jni.NewLongArray not found.
.
Probe hotspot.jni.NewLongArray.return not found.
.
Probe hotspot.jni.NewObjectA not found.
.
Probe hotspot.jni.NewObjectA.return not found.
.
Probe hotspot.jni.NewObjectArray not found.
.
Probe hotspot.jni.NewObjectArray.return not found.
.
Probe hotspot.jni.NewObject not found.
.
Probe hotspot.jni.NewObject.return not found.
.
Probe hotspot.jni.NewObjectV not found.
.
Probe hotspot.jni.NewObjectV.return not found.
.
Probe hotspot.jni.NewShortArray not found.
.
Probe hotspot.jni.NewShortArray.return not found.
.
Probe hotspot.jni.NewString not found.
.
Probe hotspot.jni.NewString.return not found.
.
Probe hotspot.jni.NewStringUTF not found.
.
Probe hotspot.jni.NewStringUTF.return not found.
.
Probe hotspot.jni.NewWeakGlobalRef not found.
.
Probe hotspot.jni.NewWeakGlobalRef.return not found.
.
Probe hotspot.jni.PopLocalFrame not found.
.
Probe hotspot.jni.PopLocalFrame.return not found.
.
Probe hotspot.jni.PushLocalFrame not found.
.
Probe hotspot.jni.PushLocalFrame.return not found.
.
Probe hotspot.jni.RegisterNatives not found.
.
Probe hotspot.jni.RegisterNatives.return not found.
.
Probe hotspot.jni.ReleaseBooleanArrayElements not found.
.
Probe hotspot.jni.ReleaseBooleanArrayElements.return not found.
.
Probe hotspot.jni.ReleaseByteArrayElements not found.
.
Probe hotspot.jni.ReleaseByteArrayElements.return not found.
.
Probe hotspot.jni.ReleaseCharArrayElements not found.
.
Probe hotspot.jni.ReleaseCharArrayElements.return not found.
.
Probe hotspot.jni.ReleaseDoubleArrayElements not found.
.
Probe hotspot.jni.ReleaseDoubleArrayElements.return not found.
.
Probe hotspot.jni.ReleaseFloatArrayElements not found.
.
Probe hotspot.jni.ReleaseFloatArrayElements.return not found.
.
Probe hotspot.jni.ReleaseIntArrayElements not found.
.
Probe hotspot.jni.ReleaseIntArrayElements.return not found.
.
Probe hotspot.jni.ReleaseLongArrayElements not found.
.
Probe hotspot.jni.ReleaseLongArrayElements.return not found.
.
Probe hotspot.jni.ReleasePrimitiveArrayCritical not found.
.
Probe hotspot.jni.ReleasePrimitiveArrayCritical.return not found.
.
Probe hotspot.jni.ReleaseShortArrayElements not found.
.
Probe hotspot.jni.ReleaseShortArrayElements.return not found.
.
Probe hotspot.jni.ReleaseStringChars not found.
.
Probe hotspot.jni.ReleaseStringChars.return not found.
.
Probe hotspot.jni.ReleaseStringCritical not found.
.
Probe hotspot.jni.ReleaseStringCritical.return not found.
.
Probe hotspot.jni.ReleaseStringUTFChars not found.
.
Probe hotspot.jni.ReleaseStringUTFChars.return not found.
.
Probe hotspot.jni.SetBooleanArrayRegion not found.
.
Probe hotspot.jni.SetBooleanArrayRegion.return not found.
.
Probe hotspot.jni.SetBooleanField not found.
.
Probe hotspot.jni.SetBooleanField.return not found.
.
Probe hotspot.jni.SetByteArrayRegion not found.
.
Probe hotspot.jni.SetByteArrayRegion.return not found.
.
Probe hotspot.jni.SetByteField not found.
.
Probe hotspot.jni.SetByteField.return not found.
.
Probe hotspot.jni.SetCharArrayRegion not found.
.
Probe hotspot.jni.SetCharArrayRegion.return not found.
.
Probe hotspot.jni.SetCharField not found.
.
Probe hotspot.jni.SetCharField.return not found.
.
Probe hotspot.jni.SetDoubleArrayRegion not found.
.
Probe hotspot.jni.SetDoubleArrayRegion.return not found.
.
Probe hotspot.jni.SetDoubleField not found.
.
Probe hotspot.jni.SetDoubleField.return not found.
.
Probe hotspot.jni.SetFloatArrayRegion not found.
.
Probe hotspot.jni.SetFloatArrayRegion.return not found.
.
Probe hotspot.jni.SetFloatField not found.
.
Probe hotspot.jni.SetFloatField.return not found.
.
Probe hotspot.jni.SetIntArrayRegion not found.
.
Probe hotspot.jni.SetIntArrayRegion.return not found.
.
Probe hotspot.jni.SetIntField not found.
.
Probe hotspot.jni.SetIntField.return not found.
.
Probe hotspot.jni.SetLongArrayRegion not found.
.
Probe hotspot.jni.SetLongArrayRegion.return not found.
.
Probe hotspot.jni.SetLongField not found.
.
Probe hotspot.jni.SetLongField.return not found.
.
Probe hotspot.jni.SetObjectArrayElement not found.
.
Probe hotspot.jni.SetObjectArrayElement.return not found.
.
Probe hotspot.jni.SetObjectField not found.
.
Probe hotspot.jni.SetObjectField.return not found.
.
Probe hotspot.jni.SetShortArrayRegion not found.
.
Probe hotspot.jni.SetShortArrayRegion.return not found.
.
Probe hotspot.jni.SetShortField not found.
.
Probe hotspot.jni.SetShortField.return not found.
.
Probe hotspot.jni.SetStaticBooleanField not found.
.
Probe hotspot.jni.SetStaticBooleanField.return not found.
.
Probe hotspot.jni.SetStaticByteField not found.
.
Probe hotspot.jni.SetStaticByteField.return not found.
.
Probe hotspot.jni.SetStaticCharField not found.
.
Probe hotspot.jni.SetStaticCharField.return not found.
.
Probe hotspot.jni.SetStaticDoubleField not found.
.
Probe hotspot.jni.SetStaticDoubleField.return not found.
.
Probe hotspot.jni.SetStaticFloatField not found.
.
Probe hotspot.jni.SetStaticFloatField.return not found.
.
Probe hotspot.jni.SetStaticIntField not found.
.
Probe hotspot.jni.SetStaticIntField.return not found.
.
Probe hotspot.jni.SetStaticLongField not found.
.
Probe hotspot.jni.SetStaticLongField.return not found.
.
Probe hotspot.jni.SetStaticObjectField not found.
.
Probe hotspot.jni.SetStaticObjectField.return not found.
.
Probe hotspot.jni.SetStaticShortField not found.
.
Probe hotspot.jni.SetStaticShortField.return not found.
.
Probe hotspot.jni.Throw not found.
.
Probe hotspot.jni.Throw.return not found.
.
Probe hotspot.jni.ThrowNew not found.
.
Probe hotspot.jni.ThrowNew.return not found.
.
Probe hotspot.jni.ToReflectedField not found.
.
Probe hotspot.jni.ToReflectedField.return not found.
.
Probe hotspot.jni.ToReflectedMethod not found.
.
Probe hotspot.jni.ToReflectedMethod.return not found.
.
Probe hotspot.jni.UnregisterNatives not found.
.
Probe hotspot.jni.UnregisterNatives.return not found.
Testing if detected probes work as expected. This may take a while...
Undetected probes: 498
Some tests did not work as expected. See file test/check-stap.log for details.
Removing compiled test files.
gmake[2]: *** [check-tapset-probes] Error 242
gmake[2]: Leaving directory `/notnfs/nighttester/icedtea7-target-testing/icedtea-2.7.0pre04/_build'
gmake[1]: *** [check-am] Error 2
gmake[1]: Leaving directory `/notnfs/nighttester/icedtea7-target-testing/icedtea-2.7.0pre04/_build'
make: *** [distcheck] Error 1
+ exit 1
Build step 'Execute shell' marked build as failure
More information about the icedtea-test
mailing list