Build failed in Jenkins: IcedTea6hgTargetTesting #1838

Hudson Admin gnu.andrew at redhat.com
Mon May 9 15:55:38 UTC 2016


See <http://toadeater.yyz.redhat.com:8080/job/IcedTea6hgTargetTesting/1838/changes>

Changes:

[Andrew John Hughes <gnu.andrew at redhat.com>] Bump to next release, b40.

2016-05-08  Andrew John Hughes  <gnu.andrew at redhat.com>

	* Makefile.am:
	(OPENJDK_VERSION): Bump to next release, b40.

[Andrew John Hughes <gnu.andrew at redhat.com>] Update to b39 tarball.

2016-05-03  Andrew John Hughes  <gnu.andrew at redhat.com>

	* Makefile.am:
	(OPENJDK_DATE): Bump to b39 creation date;
	3rd of May, 2016.
	(OPENJDK_SHA256SUM): Update for b39 tarball.

[Andrew John Hughes <gnu.andrew at redhat.com>] Merge changes for b39

[Andrew John Hughes <gnu.andrew at redhat.com>] PR2887: Location of 'stap' executable is hard-coded

2016-05-03  Andrew John Hughes  <gnu.andrew at member.fsf.org>

	PR2887: Location of 'stap' executable is hard-coded
	* configure.ac:
	Remove SDT_H_FOUND conditional around perl and stap
	tests as, in 1.x, we still have --enable-systemtap
	and fail if sdt.h is not found.

2016-03-18  Andrew John Hughes  <gnu.andrew at member.fsf.org>

	PR2887: Location of 'stap' executable is hard-coded
	* Makefile.am:
	(check-tapset-probes): Check for STAP and invoke
	generated script from build directory.
	(check-tapset-jstack): Likewise.
	* NEWS: Updated.
	* configure.ac: Detect stap and warn if not found.
	Generate test/tapset/jstaptest.pl.
	* test/tapset/jstaptest.pl.in:
	Moved from test/tapset/jstaptest.pl. Fill in location
	of stap and perl binaries from configure output.
	Fix capitalisation of "IcedTea".

[Andrew John Hughes <gnu.andrew at redhat.com>] PR2952: test/tapset/jstaptest.pl requires Perl

2016-01-29  Andrew John Hughes  <gnu.andrew at member.fsf.org>

	PR2952: test/tapset/jstaptest.pl requires Perl
	* Makefile.am:
	(check-tapset-probes): Check that Perl is available
	and, if so, use it to invoke the script.
	(check-tapset-jstack): Likewise.
	* NEWS: Updated.
	* configure.ac:
	Check for Perl if SystemTap is found, so the
	tests can be run if required.

[Andrew John Hughes <gnu.andrew at redhat.com>] Update to build against April 2016 security fixes.

Upstream changes:
  - S4459600: java -jar fails to run Main-Class if classname followed by whitespace.
  - S4963723: Implement SHA-224
  - S6378099: RFE: Use libfontconfig to create/synthesise a fontconfig.properties
  - S6414899: P11Digest should support cloning
  - S6452854: Provide a flag to print the java configuration
  - S6578658: Request for raw RSA (NONEwithRSA) Signature support in SunMSCAPI
  - S6604496: Support for CKM_AES_CTR (counter mode)
  - S6742159: (launcher) improve the java launching mechanism
  - S6752622: java.awt.Font.getPeer throws "java.lang.InternalError: Not implemented" on Linux
  - S6753664: Support SHA256 (and higher) in SunMSCAPI
  - S6758881: (launcher) needs to throw NoClassDefFoundError instead of JavaRuntimeException
  - S6812738: SSL stress test with GF leads to 32 bit max process size in less than 5 minutes with PCKS11 provider
  - S6856415: Enabling java security manager will make program thrown wrong exception ( main method not found )
  - S6892493: potential memory leaks in 2D font code indentified by parfait.
  - S6924489: sun.security.pkcs11.wrapper.PKCS11Exception: CKR_OPERATION_NOT_INITIALIZED
  - S6925851: Localize JRE into pt_BR
  - S6956398: make ephemeral DH key match the length of the certificate key
  - S6968053: (launcher) hide exceptions under certain launcher failures
  - S6977738: Deadlock between java.lang.ClassLoader and java.util.Properties
  - S6981001: (launcher) EnsureJREInstallation is not being called in order
  - S7017734: jdk7 message drop 1 translation integration
  - S7026184: (launcher) Regression: class with unicode name can't be launched by java.
  - S7033170: Cipher.getMaxAllowedKeyLength(String) throws NoSuchAlgorithmException
  - S7044060: Need to support NSA Suite B Cryptography algorithms
  - S7104161: test/sun/tools/jinfo/Basic.sh fails on Ubuntu
  - S7106773: 512 bits RSA key cannot work with SHA384 and SHA512
  - S7125442: jar application located in two bytes character named folder cannot be run with JRE 7 u1/u2
  - S7127906: (launcher) convert the launcher regression tests to java
  - S7141141: Add 3 new test scenarios for testing Main-Class attribute in jar manifest file
  - S7158988: jvm crashes while debugging on x86_32 and x86_64
  - S7189944: (launcher) test/tools/launcher/Arrrrghs.java needs a couple of minor fixes
  - S7193318: C2: remove number of inputs requirement from Node's new operator
  - S8002116: This JdbReadTwiceTest.sh gets an exit 1
  - S8004007: test/sun/tools/jinfo/Basic.sh fails on when runSA is set to true
  - S8006935: Need to take care of long secret keys in HMAC/PRF compuation
  - S8023990: Regression: postscript size increase from 6u18
  - S8027705: com/sun/jdi/JdbMethodExitTest.sh fails when a background thread is generating events.
  - S8028537: PPC64: Updated the JDK regression tests to run on AIX
  - S8036132: Tab characters in test/com/sun/jdi files
  - S8038963: com/sun/jdi tests fail because cygwin's ps sometimes misses processes
  - S8039921: SHA1WithDSA with key > 1024 bits not working
  - S8044419: TEST_BUG: com/sun/jdi/JdbReadTwiceTest.sh fails when run under root
  - S8059661: Test SoftReference and OOM behavior
  - S8067364: Printing to Postscript doesn't support dieresis
  - S8072753: Nondeterministic wrong answer on arithmetic
  - S8073735: [TEST_BUG] compiler/loopopts/CountedLoopProblem.java got OOME
  - S8074146: [TEST_BUG] jdb has succeded to read an unreadable file
  - S8075584: test for 8067364 depends on hardwired text advance
  - S8087120: [GCC5] java.lang.StackOverflowError on Zero JVM initialization on non x86 platforms.
  - S8129952: Ensure thread consistency
  - S8132051: Better byte behavior
  - S8134297: NPE in GSSNameElement nameType check
  - S8134650: Xsl transformation gives different results in 8u66
  - S8138593: Make DSA more fair
  - S8141229: [Parfait] Null pointer dereference in cmsstrcasecmp of cmserr.c
  - S8143002: [Parfait] JNI exception pending in fontpath.c:1300
  - S8143167: Better buffering of XML strings
  - S8144430: Improve JMX connections
  - S8146477: [TEST_BUG] ClientJSSEServerJSSE.java failing again
  - S8146494: Better ligature substitution
  - S8146498: Better device table adjustments
  - S8146967: [TEST_BUG] javax/security/auth/SubjectDomainCombiner/Optimize.java should use 4-args ProtectionDomain constructor
  - S8147567: InterpreterRuntime::post_field_access not updated for boolean in JDK-8132051
  - S8148446: (tz) Support tzdata2016a
  - S8148475: Missing SA Bytecode updates.
  - S8149170: Better byte behavior for native arguments
  - S8149367: PolicyQualifierInfo/index_Ctor JCk test fails with IOE: Invalid encoding for PolicyQualifierInfo
  - S8150012: Better byte behavior for reflection
  - S8150790: 8u75 L10n resource file translation update
  - S8154210: Zero: Better byte behaviour
  - S8155261: Zero broken since HS23 update
  - S8155699: Resolve issues created by backports in OpenJDK 6 b39
  - S8155699: Resolve issues created by backports in OpenJDK 6 b39, part 2
  - S8155746: Sync Windows export list in make/java/jli/Makefile with make/java/jli/mapfile-vers

ChangeLog:

2016-05-03  Andrew John Hughes  <gnu.andrew at member.fsf.org>

	* patches/openjdk/4963723-implement_sha-224.patch,
	* patches/openjdk/6578658-sunmscapi_nonewithrsa.patch,
	* patches/openjdk/6753664-sunmscapi_sha-256.patch,
	* patches/openjdk/6956398-ephemeraldhkeysize.patch,
	* patches/openjdk/7033170-getmaxallowedkeylength_throws_exception.patch,
	* patches/openjdk/7044060-support_nsa_suite_b.patch,
	* patches/openjdk/7106773-512_bits_rsa.patch,
	* patches/openjdk/8006935-long_keys_in_hmac_prf.patch,
	* patches/openjdk/8087120-zero_gcc5.patch,
	* patches/openjdk/p11cipher-6414899-p11digest_should_support_cloning.patch,
	* patches/openjdk/p11cipher-6604496-support_ckm_aes_ctr.patch,
	* patches/openjdk/p11cipher-6812738-native_cleanup.patch,
	* patches/openjdk/p11cipher-6924489-ckr_operation_not_initialized.patch,
	* patches/pr2486-768_dh.patch,
	* patches/pr2488-1024_dh.patch:
	Remove patches upstreamed in b39.
	* Makefile.am:
	(ICEDTEA_PATCHES): Remove above patches.
	* NEWS: Updated.
	* patches/openjdk/7170638-systemtap.patch:
	Regenerated due to copyright header change in jni.cpp.

[Andrew John Hughes <gnu.andrew at redhat.com>] Merge

[Andrew John Hughes <gnu.andrew at redhat.com>] New backports for issues to be fixed in 1.13.11.

S6863746, PR2951: javap should not scan ct.sym by default
S8071705, PR2820, RH1182694: Java application menu misbehaves when running multiple screen stacked vertically
S8150954, PR2868, RH1176206: AWT Robot not compatible with GNOME Shell
PR2890: OpenJDK should check for system cacerts database (e.g. /etc/pki/java/cacerts)

2016-05-03  Andrew John Hughes  <gnu.andrew at member.fsf.org>

	* Makefile.am:
	(ICEDTEA_PATCHES): Add new patches.
	* NEWS: Updated.
	* patches/openjdk/6307603-xrender-01.patch:
	Regenerated after application of 8150954 / PR2868.
	* patches/openjdk/6863746-pr2951-no_ct.sym_in_javap.patch,
	* patches/openjdk/8071705-pr2820-menu_misbehaviour.patch,
	* patches/openjdk/8150954-pr2868-composite_desktop.patch,
	* patches/pr2890-system_cacerts.patch:
	New backports for issues to be fixed in 1.13.11.

------------------------------------------
[...truncated 490639 lines...]
make[6]: Entering directory `/notnfs/nighttester/icedtea6-hg-target-testing/icedtea6-1.14.0pre/_build/openjdk-ecj/jdk/make/java/sql'
# Java sources to be compiled: (listed in file /notnfs/nighttester/icedtea6-hg-target-testing/icedtea6-1.14.0pre/_build/openjdk.build-ecj/tmp/sun/java.sql/.classes.list)
../../../src/share/classes/java/sql/Array.java
../../../src/share/classes/java/sql/SQLInvalidAuthorizationSpecException.java
../../../src/share/classes/java/sql/DriverPropertyInfo.java
../../../src/share/classes/java/sql/RowId.java
../../../src/share/classes/java/sql/SQLTransactionRollbackException.java
../../../src/share/classes/java/sql/SQLFeatureNotSupportedException.java
../../../src/share/classes/java/sql/ParameterMetaData.java
../../../src/share/classes/java/sql/SQLPermission.java
../../../src/share/classes/java/sql/SQLWarning.java
../../../src/share/classes/java/sql/DatabaseMetaData.java
../../../src/share/classes/java/sql/Types.java
../../../src/share/classes/java/sql/Date.java
../../../src/share/classes/java/sql/Struct.java
../../../src/share/classes/java/sql/BatchUpdateException.java
../../../src/share/classes/java/sql/SQLRecoverableException.java
../../../src/share/classes/java/sql/SQLTransientConnectionException.java
../../../src/share/classes/java/sql/Blob.java
../../../src/share/classes/java/sql/ClientInfoStatus.java
../../../src/share/classes/java/sql/RowIdLifetime.java
../../../src/share/classes/java/sql/SQLOutput.java
../../../src/share/classes/java/sql/SQLData.java
../../../src/share/classes/java/sql/SQLIntegrityConstraintViolationException.java
../../../src/share/classes/java/sql/Ref.java
../../../src/share/classes/java/sql/SQLTransientException.java
../../../src/share/classes/java/sql/DataTruncation.java
../../../src/share/classes/java/sql/Connection.java
../../../src/share/classes/java/sql/SQLDataException.java
../../../src/share/classes/java/sql/SQLTimeoutException.java
../../../src/share/classes/java/sql/Clob.java
../../../src/share/classes/java/sql/DriverManager.java
../../../src/share/classes/java/sql/SQLException.java
../../../src/share/classes/java/sql/SQLClientInfoException.java
../../../src/share/classes/java/sql/SQLXML.java
../../../src/share/classes/java/sql/Statement.java
../../../src/share/classes/java/sql/PreparedStatement.java
../../../src/share/classes/java/sql/Savepoint.java
../../../src/share/classes/java/sql/ResultSet.java
../../../src/share/classes/java/sql/SQLNonTransientConnectionException.java
../../../src/share/classes/java/sql/Timestamp.java
../../../src/share/classes/java/sql/Driver.java
../../../src/share/classes/java/sql/Time.java
../../../src/share/classes/java/sql/SQLNonTransientException.java
../../../src/share/classes/java/sql/NClob.java
../../../src/share/classes/java/sql/CallableStatement.java
../../../src/share/classes/java/sql/ResultSetMetaData.java
../../../src/share/classes/java/sql/SQLInput.java
../../../src/share/classes/java/sql/SQLSyntaxErrorException.java
../../../src/share/classes/java/sql/Wrapper.java
# Running javac:
/notnfs/nighttester/icedtea6-hg-target-testing/icedtea6-1.14.0pre/_build/bootstrap/jdk1.6.0/bin/javac -J-XX:ThreadStackSize=2048 -J-Xmx896m -J-Xms128m -J-XX:PermSize=32m -J-XX:MaxPermSize=160m -g -source 1.5 -target 5 -encoding ascii -Xbootclasspath:/notnfs/nighttester/icedtea6-hg-target-testing/icedtea6-1.14.0pre/_build/openjdk.build-ecj/classes -sourcepath /notnfs/nighttester/icedtea6-hg-target-testing/icedtea6-1.14.0pre/_build/generated.build:../../../src/solaris/classes:../../../src/share/classes -d /notnfs/nighttester/icedtea6-hg-target-testing/icedtea6-1.14.0pre/_build/openjdk.build-ecj/classes @/notnfs/nighttester/icedtea6-hg-target-testing/icedtea6-1.14.0pre/_build/openjdk.build-ecj/tmp/sun/java.sql/.classes.list
make[6]: Leaving directory `/notnfs/nighttester/icedtea6-hg-target-testing/icedtea6-1.14.0pre/_build/openjdk-ecj/jdk/make/java/sql'
  Timing: 00001 seconds or 1s for make-java-sql
<<<Finished Recursively making sql all @ Mon May  9 11:55:20 EDT 2016.
>>>Recursively making rmi all @ Mon May  9 11:55:20 EDT 2016 ...
make[6]: Entering directory `/notnfs/nighttester/icedtea6-hg-target-testing/icedtea6-1.14.0pre/_build/openjdk-ecj/jdk/make/java/rmi'
# Java sources to be compiled: (listed in file /notnfs/nighttester/icedtea6-hg-target-testing/icedtea6-1.14.0pre/_build/openjdk.build-ecj/tmp/sun/java.rmi/.classes.list)
../../../src/share/classes/java/rmi/server/SocketSecurityException.java
../../../src/share/classes/java/rmi/server/LoaderHandler.java
../../../src/share/classes/java/rmi/server/SkeletonMismatchException.java
../../../src/share/classes/java/rmi/ServerRuntimeException.java
../../../src/share/classes/java/rmi/registry/RegistryHandler.java
../../../src/share/classes/java/rmi/RMISecurityException.java
# Running javac:
/notnfs/nighttester/icedtea6-hg-target-testing/icedtea6-1.14.0pre/_build/bootstrap/jdk1.6.0/bin/javac -J-XX:ThreadStackSize=2048 -J-Xmx896m -J-Xms128m -J-XX:PermSize=32m -J-XX:MaxPermSize=160m -g -source 1.5 -target 5 -encoding ascii -Xbootclasspath:/notnfs/nighttester/icedtea6-hg-target-testing/icedtea6-1.14.0pre/_build/openjdk.build-ecj/classes -sourcepath /notnfs/nighttester/icedtea6-hg-target-testing/icedtea6-1.14.0pre/_build/generated.build:../../../src/solaris/classes:../../../src/share/classes -d /notnfs/nighttester/icedtea6-hg-target-testing/icedtea6-1.14.0pre/_build/openjdk.build-ecj/classes @/notnfs/nighttester/icedtea6-hg-target-testing/icedtea6-1.14.0pre/_build/openjdk.build-ecj/tmp/sun/java.rmi/.classes.list
make[6]: Leaving directory `/notnfs/nighttester/icedtea6-hg-target-testing/icedtea6-1.14.0pre/_build/openjdk-ecj/jdk/make/java/rmi'
  Timing: 00001 seconds or 1s for make-java-rmi
<<<Finished Recursively making rmi all @ Mon May  9 11:55:21 EDT 2016.
>>>Recursively making jar all @ Mon May  9 11:55:21 EDT 2016 ...
make[6]: Entering directory `/notnfs/nighttester/icedtea6-hg-target-testing/icedtea6-1.14.0pre/_build/openjdk-ecj/jdk/make/java/jar'
# Java sources to be compiled: (listed in file /notnfs/nighttester/icedtea6-hg-target-testing/icedtea6-1.14.0pre/_build/openjdk.build-ecj/tmp/sun/java.util.jar/.classes.list)
../../../src/share/classes/java/util/jar/Pack200.java
../../../src/share/classes/java/util/jar/JarOutputStream.java
# Running javac:
/notnfs/nighttester/icedtea6-hg-target-testing/icedtea6-1.14.0pre/_build/bootstrap/jdk1.6.0/bin/javac -J-XX:ThreadStackSize=2048 -J-Xmx896m -J-Xms128m -J-XX:PermSize=32m -J-XX:MaxPermSize=160m -g -source 1.5 -target 5 -encoding ascii -Xbootclasspath:/notnfs/nighttester/icedtea6-hg-target-testing/icedtea6-1.14.0pre/_build/openjdk.build-ecj/classes -sourcepath /notnfs/nighttester/icedtea6-hg-target-testing/icedtea6-1.14.0pre/_build/generated.build:../../../src/solaris/classes:../../../src/share/classes -d /notnfs/nighttester/icedtea6-hg-target-testing/icedtea6-1.14.0pre/_build/openjdk.build-ecj/classes @/notnfs/nighttester/icedtea6-hg-target-testing/icedtea6-1.14.0pre/_build/openjdk.build-ecj/tmp/sun/java.util.jar/.classes.list
make[6]: Leaving directory `/notnfs/nighttester/icedtea6-hg-target-testing/icedtea6-1.14.0pre/_build/openjdk-ecj/jdk/make/java/jar'
  Timing: 00005 seconds or 5s for make-java-jar
<<<Finished Recursively making jar all @ Mon May  9 11:55:26 EDT 2016.
>>>Recursively making beans all @ Mon May  9 11:55:26 EDT 2016 ...
make[6]: Entering directory `/notnfs/nighttester/icedtea6-hg-target-testing/icedtea6-1.14.0pre/_build/openjdk-ecj/jdk/make/java/beans'
# Java sources to be compiled: (listed in file /notnfs/nighttester/icedtea6-hg-target-testing/icedtea6-1.14.0pre/_build/openjdk.build-ecj/tmp/java/java.beans/.classes.list)
../../../src/share/classes/java/beans/XMLEncoder.java
../../../src/share/classes/java/beans/XMLDecoder.java
../../../src/share/classes/java/beans/ReflectionUtils.java
../../../src/share/classes/java/beans/PropertyEditorSupport.java
../../../src/share/classes/java/beans/AppletInitializer.java
../../../src/share/classes/java/beans/Encoder.java
../../../src/share/classes/java/beans/Visibility.java
../../../src/share/classes/java/beans/PersistenceDelegate.java
../../../src/share/classes/java/beans/DesignMode.java
../../../src/share/classes/java/beans/Customizer.java
../../../src/share/classes/java/beans/DefaultPersistenceDelegate.java
../../../src/share/classes/java/beans/ExceptionListener.java
../../../src/share/classes/java/beans/Expression.java
../../../src/share/classes/java/beans/Beans.java
../../../src/share/classes/java/beans/Statement.java
../../../src/share/classes/java/beans/MetaData.java
../../../src/share/classes/java/beans/PropertyEditorManager.java
../../../src/share/classes/java/beans/beancontext/BeanContextServiceRevokedListener.java
../../../src/share/classes/java/beans/beancontext/BeanContextProxy.java
../../../src/share/classes/java/beans/beancontext/BeanContextServicesSupport.java
../../../src/share/classes/java/beans/beancontext/BeanContextChildSupport.java
../../../src/share/classes/java/beans/beancontext/BeanContextServiceProviderBeanInfo.java
../../../src/share/classes/java/beans/beancontext/BeanContextServicesListener.java
../../../src/share/classes/java/beans/beancontext/BeanContextServiceProvider.java
../../../src/share/classes/java/beans/beancontext/BeanContextMembershipEvent.java
../../../src/share/classes/java/beans/beancontext/BeanContextContainerProxy.java
../../../src/share/classes/java/beans/beancontext/BeanContext.java
../../../src/share/classes/java/beans/beancontext/BeanContextChildComponentProxy.java
../../../src/share/classes/java/beans/beancontext/BeanContextServiceRevokedEvent.java
../../../src/share/classes/java/beans/beancontext/BeanContextServiceAvailableEvent.java
../../../src/share/classes/java/beans/beancontext/BeanContextMembershipListener.java
../../../src/share/classes/java/beans/beancontext/BeanContextChild.java
../../../src/share/classes/java/beans/beancontext/BeanContextServices.java
../../../src/share/classes/java/beans/beancontext/BeanContextSupport.java
../../../src/share/classes/java/beans/beancontext/BeanContextEvent.java
../../../src/share/classes/java/beans/EventHandler.java
../../../src/share/classes/com/sun/beans/editors/EnumEditor.java
../../../src/share/classes/com/sun/beans/editors/NumberEditor.java
../../../src/share/classes/com/sun/beans/editors/ColorEditor.java
../../../src/share/classes/com/sun/beans/editors/ShortEditor.java
../../../src/share/classes/com/sun/beans/editors/BooleanEditor.java
../../../src/share/classes/com/sun/beans/editors/StringEditor.java
../../../src/share/classes/com/sun/beans/editors/IntegerEditor.java
../../../src/share/classes/com/sun/beans/editors/ByteEditor.java
../../../src/share/classes/com/sun/beans/editors/LongEditor.java
../../../src/share/classes/com/sun/beans/editors/DoubleEditor.java
../../../src/share/classes/com/sun/beans/editors/FloatEditor.java
../../../src/share/classes/com/sun/beans/editors/FontEditor.java
../../../src/share/classes/com/sun/beans/infos/ComponentBeanInfo.java
../../../src/share/classes/com/sun/beans/ObjectHandler.java
# Running javac:
/notnfs/nighttester/icedtea6-hg-target-testing/icedtea6-1.14.0pre/_build/bootstrap/jdk1.6.0/bin/javac -J-XX:ThreadStackSize=2048 -J-Xmx896m -J-Xms128m -J-XX:PermSize=32m -J-XX:MaxPermSize=160m -g -source 1.5 -target 5 -encoding ascii -Xbootclasspath:/notnfs/nighttester/icedtea6-hg-target-testing/icedtea6-1.14.0pre/_build/openjdk.build-ecj/classes -sourcepath /notnfs/nighttester/icedtea6-hg-target-testing/icedtea6-1.14.0pre/_build/generated.build:../../../src/solaris/classes:../../../src/share/classes -d /notnfs/nighttester/icedtea6-hg-target-testing/icedtea6-1.14.0pre/_build/openjdk.build-ecj/classes @/notnfs/nighttester/icedtea6-hg-target-testing/icedtea6-1.14.0pre/_build/openjdk.build-ecj/tmp/java/java.beans/.classes.list
make[6]: Leaving directory `/notnfs/nighttester/icedtea6-hg-target-testing/icedtea6-1.14.0pre/_build/openjdk-ecj/jdk/make/java/beans'
  Timing: 00004 seconds or 4s for make-java-beans
<<<Finished Recursively making beans all @ Mon May  9 11:55:30 EDT 2016.
>>>Recursively making logging all @ Mon May  9 11:55:30 EDT 2016 ...
make[6]: Entering directory `/notnfs/nighttester/icedtea6-hg-target-testing/icedtea6-1.14.0pre/_build/openjdk-ecj/jdk/make/java/logging'
rm -f /notnfs/nighttester/icedtea6-hg-target-testing/icedtea6-1.14.0pre/_build/generated.build/sun/util/logging/resources/logging_pt_BR.java
# Adding to compile properties list: ../../../src/share/classes/sun/util/logging/resources/logging_pt_BR.properties -> /notnfs/nighttester/icedtea6-hg-target-testing/icedtea6-1.14.0pre/_build/generated.build/sun/util/logging/resources/logging_pt_BR.java
/bin/echo -e "-compile ../../../src/share/classes/sun/util/logging/resources/logging_pt_BR.properties /notnfs/nighttester/icedtea6-hg-target-testing/icedtea6-1.14.0pre/_build/generated.build/sun/util/logging/resources/logging_pt_BR.java ListResourceBundle" >> /notnfs/nighttester/icedtea6-hg-target-testing/icedtea6-1.14.0pre/_build/openjdk.build-ecj/tmp/java/java.util.logging/compile_prop_options
/notnfs/nighttester/icedtea6-hg-target-testing/icedtea6-1.14.0pre/_build/bootstrap/jdk1.6.0/bin/java  -Xmx896m -Xms128m -XX:PermSize=32m -XX:MaxPermSize=160m -jar /notnfs/nighttester/icedtea6-hg-target-testing/icedtea6-1.14.0pre/_build/openjdk.build-ecj/btjars/compileproperties.jar -optionsfile /notnfs/nighttester/icedtea6-hg-target-testing/icedtea6-1.14.0pre/_build/openjdk.build-ecj/tmp/java/java.util.logging/compile_prop_options
parsing: ../../../src/share/classes/sun/util/logging/resources/logging_pt_BR.properties
inferred package name: sun.util.logging.resources
wrote: /notnfs/nighttester/icedtea6-hg-target-testing/icedtea6-1.14.0pre/_build/generated.build/sun/util/logging/resources/logging_pt_BR.java
# Java sources to be compiled: (listed in file /notnfs/nighttester/icedtea6-hg-target-testing/icedtea6-1.14.0pre/_build/openjdk.build-ecj/tmp/java/java.util.logging/.classes.list)
/notnfs/nighttester/icedtea6-hg-target-testing/icedtea6-1.14.0pre/_build/generated.build/sun/util/logging/resources/logging.java
/notnfs/nighttester/icedtea6-hg-target-testing/icedtea6-1.14.0pre/_build/generated.build/sun/util/logging/resources/logging_de.java
/notnfs/nighttester/icedtea6-hg-target-testing/icedtea6-1.14.0pre/_build/generated.build/sun/util/logging/resources/logging_es.java
/notnfs/nighttester/icedtea6-hg-target-testing/icedtea6-1.14.0pre/_build/generated.build/sun/util/logging/resources/logging_fr.java
/notnfs/nighttester/icedtea6-hg-target-testing/icedtea6-1.14.0pre/_build/generated.build/sun/util/logging/resources/logging_it.java
/notnfs/nighttester/icedtea6-hg-target-testing/icedtea6-1.14.0pre/_build/generated.build/sun/util/logging/resources/logging_ja.java
/notnfs/nighttester/icedtea6-hg-target-testing/icedtea6-1.14.0pre/_build/generated.build/sun/util/logging/resources/logging_ko.java
/notnfs/nighttester/icedtea6-hg-target-testing/icedtea6-1.14.0pre/_build/generated.build/sun/util/logging/resources/logging_pt_BR.java
/notnfs/nighttester/icedtea6-hg-target-testing/icedtea6-1.14.0pre/_build/generated.build/sun/util/logging/resources/logging_sv.java
/notnfs/nighttester/icedtea6-hg-target-testing/icedtea6-1.14.0pre/_build/generated.build/sun/util/logging/resources/logging_zh_CN.java
/notnfs/nighttester/icedtea6-hg-target-testing/icedtea6-1.14.0pre/_build/generated.build/sun/util/logging/resources/logging_zh_TW.java
/notnfs/nighttester/icedtea6-hg-target-testing/icedtea6-1.14.0pre/_build/generated.build/sun/util/logging/resources/logging_zh_HK.java
../../../src/share/classes/java/util/logging/XMLFormatter.java
../../../src/share/classes/java/util/logging/MemoryHandler.java
../../../src/share/classes/java/util/logging/SocketHandler.java
../../../src/share/classes/java/util/logging/FileHandler.java
# Running javac:
/notnfs/nighttester/icedtea6-hg-target-testing/icedtea6-1.14.0pre/_build/bootstrap/jdk1.6.0/bin/javac -J-XX:ThreadStackSize=2048 -J-Xmx896m -J-Xms128m -J-XX:PermSize=32m -J-XX:MaxPermSize=160m -g -source 1.5 -target 5 -encoding ascii -Xbootclasspath:/notnfs/nighttester/icedtea6-hg-target-testing/icedtea6-1.14.0pre/_build/openjdk.build-ecj/classes -sourcepath /notnfs/nighttester/icedtea6-hg-target-testing/icedtea6-1.14.0pre/_build/generated.build:../../../src/solaris/classes:../../../src/share/classes -d /notnfs/nighttester/icedtea6-hg-target-testing/icedtea6-1.14.0pre/_build/openjdk.build-ecj/classes @/notnfs/nighttester/icedtea6-hg-target-testing/icedtea6-1.14.0pre/_build/openjdk.build-ecj/tmp/java/java.util.logging/.classes.list
/bin/mkdir -p /notnfs/nighttester/icedtea6-hg-target-testing/icedtea6-1.14.0pre/_build/openjdk.build-ecj/lib
rm -f /notnfs/nighttester/icedtea6-hg-target-testing/icedtea6-1.14.0pre/_build/openjdk.build-ecj/lib/logging.properties
/bin/cp ../../../src/share/lib/logging.properties /notnfs/nighttester/icedtea6-hg-target-testing/icedtea6-1.14.0pre/_build/openjdk.build-ecj/lib/logging.properties
make[6]: Leaving directory `/notnfs/nighttester/icedtea6-hg-target-testing/icedtea6-1.14.0pre/_build/openjdk-ecj/jdk/make/java/logging'
  Timing: 00001 seconds or 1s for make-java-logging
<<<Finished Recursively making logging all @ Mon May  9 11:55:31 EDT 2016.
>>>Recursively making management all @ Mon May  9 11:55:31 EDT 2016 ...
make[6]: Entering directory `/notnfs/nighttester/icedtea6-hg-target-testing/icedtea6-1.14.0pre/_build/openjdk-ecj/jdk/make/java/management'
rm -f /notnfs/nighttester/icedtea6-hg-target-testing/icedtea6-1.14.0pre/_build/generated.build/sun/management/resources/agent_pt_BR.java
# Adding to compile properties list: ../../../src/share/classes/sun/management/resources/agent_pt_BR.properties -> /notnfs/nighttester/icedtea6-hg-target-testing/icedtea6-1.14.0pre/_build/generated.build/sun/management/resources/agent_pt_BR.java
/bin/echo -e "-compile ../../../src/share/classes/sun/management/resources/agent_pt_BR.properties /notnfs/nighttester/icedtea6-hg-target-testing/icedtea6-1.14.0pre/_build/generated.build/sun/management/resources/agent_pt_BR.java ListResourceBundle" >> /notnfs/nighttester/icedtea6-hg-target-testing/icedtea6-1.14.0pre/_build/openjdk.build-ecj/tmp/java/java.lang.management/management/compile_prop_options
/notnfs/nighttester/icedtea6-hg-target-testing/icedtea6-1.14.0pre/_build/bootstrap/jdk1.6.0/bin/java  -Xmx896m -Xms128m -XX:PermSize=32m -XX:MaxPermSize=160m -jar /notnfs/nighttester/icedtea6-hg-target-testing/icedtea6-1.14.0pre/_build/openjdk.build-ecj/btjars/compileproperties.jar -optionsfile /notnfs/nighttester/icedtea6-hg-target-testing/icedtea6-1.14.0pre/_build/openjdk.build-ecj/tmp/java/java.lang.management/management/compile_prop_options
parsing: ../../../src/share/classes/sun/management/resources/agent_pt_BR.properties
inferred package name: sun.management.resources
wrote: /notnfs/nighttester/icedtea6-hg-target-testing/icedtea6-1.14.0pre/_build/generated.build/sun/management/resources/agent_pt_BR.java
# Java sources to be compiled: (listed in file /notnfs/nighttester/icedtea6-hg-target-testing/icedtea6-1.14.0pre/_build/openjdk.build-ecj/tmp/java/java.lang.management/management/.classes.list)
/notnfs/nighttester/icedtea6-hg-target-testing/icedtea6-1.14.0pre/_build/generated.build/sun/management/resources/agent.java
/notnfs/nighttester/icedtea6-hg-target-testing/icedtea6-1.14.0pre/_build/generated.build/sun/management/resources/agent_de.java
/notnfs/nighttester/icedtea6-hg-target-testing/icedtea6-1.14.0pre/_build/generated.build/sun/management/resources/agent_es.java
/notnfs/nighttester/icedtea6-hg-target-testing/icedtea6-1.14.0pre/_build/generated.build/sun/management/resources/agent_fr.java
/notnfs/nighttester/icedtea6-hg-target-testing/icedtea6-1.14.0pre/_build/generated.build/sun/management/resources/agent_it.java
/notnfs/nighttester/icedtea6-hg-target-testing/icedtea6-1.14.0pre/_build/generated.build/sun/management/resources/agent_ja.java
/notnfs/nighttester/icedtea6-hg-target-testing/icedtea6-1.14.0pre/_build/generated.build/sun/management/resources/agent_ko.java
/notnfs/nighttester/icedtea6-hg-target-testing/icedtea6-1.14.0pre/_build/generated.build/sun/management/resources/agent_pt_BR.java
/notnfs/nighttester/icedtea6-hg-target-testing/icedtea6-1.14.0pre/_build/generated.build/sun/management/resources/agent_sv.java
/notnfs/nighttester/icedtea6-hg-target-testing/icedtea6-1.14.0pre/_build/generated.build/sun/management/resources/agent_zh_CN.java
/notnfs/nighttester/icedtea6-hg-target-testing/icedtea6-1.14.0pre/_build/generated.build/sun/management/resources/agent_zh_TW.java
/notnfs/nighttester/icedtea6-hg-target-testing/icedtea6-1.14.0pre/_build/generated.build/sun/management/resources/agent_zh_HK.java
../../../src/share/classes/sun/management/ConnectorAddressLink.java
../../../src/share/classes/sun/management/AgentConfigurationError.java
../../../src/share/classes/sun/management/HotspotInternalMBean.java
../../../src/share/classes/sun/management/jmxremote/SingleEntryRegistry.java
../../../src/share/classes/sun/management/jmxremote/SSLContextRMIServerSocketFactory.java
../../../src/share/classes/sun/management/jmxremote/ConnectorBootstrap.java
../../../src/share/classes/sun/management/jmxremote/LocalRMIServerSocketFactory.java
../../../src/share/classes/sun/management/HotspotInternal.java
../../../src/share/classes/sun/management/FileSystem.java
../../../src/share/classes/sun/management/Agent.java
../../../src/solaris/classes/sun/management/FileSystemImpl.java
# Running javac:
/notnfs/nighttester/icedtea6-hg-target-testing/icedtea6-1.14.0pre/_build/bootstrap/jdk1.6.0/bin/javac -J-XX:ThreadStackSize=2048 -J-Xmx896m -J-Xms128m -J-XX:PermSize=32m -J-XX:MaxPermSize=160m -g -source 1.5 -target 5 -encoding ascii -Xbootclasspath:/notnfs/nighttester/icedtea6-hg-target-testing/icedtea6-1.14.0pre/_build/openjdk.build-ecj/classes -sourcepath /notnfs/nighttester/icedtea6-hg-target-testing/icedtea6-1.14.0pre/_build/generated.build:../../../src/solaris/classes:../../../src/share/classes -d /notnfs/nighttester/icedtea6-hg-target-testing/icedtea6-1.14.0pre/_build/openjdk.build-ecj/classes @/notnfs/nighttester/icedtea6-hg-target-testing/icedtea6-1.14.0pre/_build/openjdk.build-ecj/tmp/java/java.lang.management/management/.classes.list
----------
1. ERROR in /notnfs/nighttester/icedtea6-hg-target-testing/icedtea6-1.14.0pre/_build/openjdk-ecj/jdk/src/share/classes/javax/management/remote/rmi/RMIJRMPServerImpl.java (at line 231)
	public String getVersion() throws RemoteException {
	              ^^^^^^^^^^^^^^^^^^^^^^^^^^^^^^^^^^^
The method getVersion() of type RMIJRMPServerImpl.ExportedWrapper must override a superclass method
----------
2. ERROR in /notnfs/nighttester/icedtea6-hg-target-testing/icedtea6-1.14.0pre/_build/openjdk-ecj/jdk/src/share/classes/javax/management/remote/rmi/RMIJRMPServerImpl.java (at line 236)
	public RMIConnection newClient(Object credentials) throws IOException {
	                     ^^^^^^^^^^^^^^^^^^^^^^^^^^^^^^^^^^^^^^^^^^^^^^^^
The method newClient(Object) of type RMIJRMPServerImpl.ExportedWrapper must override a superclass method
----------
3. ERROR in /notnfs/nighttester/icedtea6-hg-target-testing/icedtea6-1.14.0pre/_build/openjdk-ecj/jdk/src/share/classes/javax/management/remote/rmi/RMIJRMPServerImpl.java (at line 241)
	public void check(Method method, ObjectStreamClass descriptor,
                int paramIndex, int callID) {
	            ^^^^^^^^^^^^^^^^^^^^^^^^^^^^^^^^^^^^^^^^^^^^^^^^^^^^^^^^^^^^^^^^^^^^^^^^^^^^^^^^^^^^^^^^^^^^^^
The method check(Method, ObjectStreamClass, int, int) of type RMIJRMPServerImpl.ExportedWrapper must override a superclass method
----------
4. ERROR in /notnfs/nighttester/icedtea6-hg-target-testing/icedtea6-1.14.0pre/_build/openjdk-ecj/jdk/src/share/classes/javax/management/remote/rmi/RMIJRMPServerImpl.java (at line 251)
	public void checkProxyClass(Method method, String[] ifaces,
                int paramIndex, int callID) {
	            ^^^^^^^^^^^^^^^^^^^^^^^^^^^^^^^^^^^^^^^^^^^^^^^^^^^^^^^^^^^^^^^^^^^^^^^^^^^^^^^^^^^^^^^^^^^
The method checkProxyClass(Method, String[], int, int) of type RMIJRMPServerImpl.ExportedWrapper must override a superclass method
----------
5. ERROR in /notnfs/nighttester/icedtea6-hg-target-testing/icedtea6-1.14.0pre/_build/openjdk-ecj/jdk/src/share/classes/javax/management/remote/rmi/RMIJRMPServerImpl.java (at line 263)
	public void end(int callID) {
	            ^^^^^^^^^^^^^^^
The method end(int) of type RMIJRMPServerImpl.ExportedWrapper must override a superclass method
----------
5 problems (5 errors)make[6]: *** [.compile.classlist] Error 255
make[6]: Leaving directory `/notnfs/nighttester/icedtea6-hg-target-testing/icedtea6-1.14.0pre/_build/openjdk-ecj/jdk/make/java/management'
make[5]: *** [all] Error 1
make[5]: Leaving directory `/notnfs/nighttester/icedtea6-hg-target-testing/icedtea6-1.14.0pre/_build/openjdk-ecj/jdk/make/java'
make[4]: *** [all] Error 1
make[4]: Leaving directory `/notnfs/nighttester/icedtea6-hg-target-testing/icedtea6-1.14.0pre/_build/openjdk-ecj/jdk/make'
make[3]: *** [jdk-build] Error 2
make[3]: Leaving directory `/notnfs/nighttester/icedtea6-hg-target-testing/icedtea6-1.14.0pre/_build/openjdk-ecj'
make[2]: *** [build_product_image] Error 2
make[2]: Leaving directory `/notnfs/nighttester/icedtea6-hg-target-testing/icedtea6-1.14.0pre/_build/openjdk-ecj'
make[1]: *** [stamps/icedtea-ecj.stamp] Error 2
make[1]: Leaving directory `/notnfs/nighttester/icedtea6-hg-target-testing/icedtea6-1.14.0pre/_build'
make: *** [distcheck] Error 1
+ exit 1
Build step 'Execute shell' marked build as failure


More information about the icedtea-test mailing list