Build failed in Jenkins: IcedTea7TargetTesting #2615
Hudson Admin
gnu.andrew at redhat.com
Tue Jul 18 11:59:43 UTC 2017
See <http://toadeater.yyz.redhat.com:8080/job/IcedTea7TargetTesting/2615/changes>
Changes:
[Andrew John Hughes <gnu_andrew at member.fsf.org>] Add 2.6.10 release notes.
2017-06-05 Andrew John Hughes <gnu_andrew at member.fsf.org>
* NEWS: Add 2.6.10 release notes.
------------------------------------------
[...truncated 39.44 MB...]
ALT_JDK_DEVTOOLS_DIR =
ANT_HOME =
UNIXCOMMAND_PATH = /bin/
ALT_UNIXCOMMAND_PATH =
COMPILER_PATH = /usr/bin/
ALT_COMPILER_PATH =
DEVTOOLS_PATH = /usr/bin/
ALT_DEVTOOLS_PATH =
UNIXCCS_PATH = /usr/ccs/bin/
ALT_UNIXCCS_PATH =
USRBIN_PATH = /usr/bin/
ALT_USRBIN_PATH =
COMPILER_NAME = GCC4
COMPILER_VERSION = GCC4
CC_VER = 4.8.3 [requires at least 3.2]
ZIP_VER = 3.0 [requires at least 2.2]
UNZIP_VER = 6.00 [requires at least 5.12]
ANT_VER = 1.9.2 [requires at least 1.7.1]
TEMPDIR = /notnfs/nighttester/icedtea7-target-testing/openjdk.build/tmp
Build Directives:
OPENJDK = true
USE_HOTSPOT_INTERPRETER_MODE =
PEDANTIC =
DEV_ONLY =
NO_DOCS =
NO_IMAGES =
TOOLS_ONLY =
INSANE =
COMPILE_APPROACH = parallel
PARALLEL_COMPILE_JOBS = 3
ALT_PARALLEL_COMPILE_JOBS = 3
FASTDEBUG =
COMPILER_WARNINGS_FATAL = false
COMPILER_WARNING_LEVEL =
SHOW_ALL_WARNINGS =
INCREMENTAL_BUILD = false
CC_HIGHEST_OPT =
CC_HIGHER_OPT =
CC_LOWER_OPT =
CXXFLAGS = -O2 -std=gnu++98 -fPIC -DCC_NOEX -W -Wall -Wno-unused -Wno-parentheses -fno-omit-frame-pointer -D_LITTLE_ENDIAN -g
CFLAGS = -O2 -fno-strict-aliasing -fPIC -W -Wall -Wno-unused -Wno-parentheses -pipe -fno-omit-frame-pointer -D_LITTLE_ENDIAN -g
BOOT_JAVA_CMD = /notnfs/nighttester/icedtea7-target-testing/bootstrap/jdk1.6.0/bin/java -XX:-PrintVMOptions -XX:+UnlockDiagnosticVMOptions -XX:-LogVMOutput -Xmx512m -Xms512m -XX:PermSize=32m -XX:MaxPermSize=160m
BOOT_JAVAC_CMD = /notnfs/nighttester/icedtea7-target-testing/bootstrap/jdk1.6.0/bin/javac -J-XX:ThreadStackSize=1664 -J-XX:-PrintVMOptions -J-XX:+UnlockDiagnosticVMOptions -J-XX:-LogVMOutput -J-Xmx512m -J-Xms512m -J-XX:PermSize=32m -J-XX:MaxPermSize=160m -Xlint:-path -encoding ascii -source 6 -target 6 -XDignore.symbol.file=true -bootclasspath /notnfs/nighttester/icedtea7-target-testing/bootstrap/jdk1.6.0/jre/lib/rt.jar
BOOT_JAR_CMD = /notnfs/nighttester/icedtea7-target-testing/bootstrap/jdk1.6.0/bin/jar
BOOT_JARSIGNER_CMD = /notnfs/nighttester/icedtea7-target-testing/bootstrap/jdk1.6.0/bin/jarsigner
JAVAC_CMD = /notnfs/nighttester/icedtea7-target-testing/bootstrap/jdk1.6.0/bin/javac -J-XX:ThreadStackSize=1664 -J-XX:-PrintVMOptions -J-XX:+UnlockDiagnosticVMOptions -J-XX:-LogVMOutput -J-Xmx512m -J-Xms512m -J-XX:PermSize=32m -J-XX:MaxPermSize=160m -g -Xlint:-path -source 7 -target 7 -encoding ascii -Xbootclasspath:/notnfs/nighttester/icedtea7-target-testing/openjdk.build/classes
JAVAH_CMD = /notnfs/nighttester/icedtea7-target-testing/bootstrap/jdk1.6.0/bin/javah -bootclasspath /notnfs/nighttester/icedtea7-target-testing/openjdk.build/classes
JAVADOC_CMD = /notnfs/nighttester/icedtea7-target-testing/bootstrap/jdk1.6.0/bin/javadoc -J-XX:-PrintVMOptions -J-XX:+UnlockDiagnosticVMOptions -J-XX:-LogVMOutput -J-Xmx512m -J-Xms512m -J-XX:PermSize=32m -J-XX:MaxPermSize=160m -bootclasspath /notnfs/nighttester/icedtea7-target-testing/openjdk.build/classes
Build Platform Settings:
USER = nighttester
PLATFORM = linux
ARCH = amd64
LIBARCH = amd64
ARCH_FAMILY = amd64
ARCH_DATA_MODEL = 64
ARCHPROP = amd64
ALSA_VERSION = 1.0.27.2
OS_VERSION = 3.19.8-100.fc20.x86_64 [requires at least 2.6]
OS_VARIANT_NAME = Fedora
OS_VARIANT_VERSION = 20
MB_OF_MEMORY = 3815
GNU Make Settings:
MAKE = /bin/gmake
MAKE_VER = 3.82 [requires at least 3.81]
MAKECMDGOALS = sanity
MAKEFLAGS = w
SHELL = /bin/sh
Target Build Versions:
JDK_VERSION = 1.7.0_131
MILESTONE = fcs
RELEASE = 1.7.0_131
FULL_VERSION = 1.7.0_131-b00
BUILD_NUMBER = b00
External File/Binary Locations:
USRJDKINSTANCES_PATH = /opt/java
BUILD_JDK_IMPORT_PATH = /NOT-SET/re/jdk/1.7.0_131/promoted/latest/binaries
ALT_BUILD_JDK_IMPORT_PATH =
JDK_IMPORT_PATH = /notnfs/nighttester/icedtea7-target-testing/bootstrap/jdk1.6.0
ALT_JDK_IMPORT_PATH = /notnfs/nighttester/icedtea7-target-testing/bootstrap/jdk1.6.0
LANGTOOLS_DIST =
ALT_LANGTOOLS_DIST = /notnfs/nighttester/icedtea7-target-testing/openjdk.build/langtools/dist
CORBA_DIST =
ALT_CORBA_DIST = /notnfs/nighttester/icedtea7-target-testing/openjdk.build/corba/dist
JAXP_DIST =
ALT_JAXP_DIST = /notnfs/nighttester/icedtea7-target-testing/openjdk.build/jaxp/dist
JAXWS_DIST =
ALT_JAXWS_DIST = /notnfs/nighttester/icedtea7-target-testing/openjdk.build/jaxws/dist
HOTSPOT_DOCS_IMPORT_PATH = /NO_DOCS_DIR
ALT_HOTSPOT_DOCS_IMPORT_PATH =
HOTSPOT_IMPORT_PATH = /notnfs/nighttester/icedtea7-target-testing/jamvm/install/hotspot
ALT_HOTSPOT_IMPORT_PATH = /notnfs/nighttester/icedtea7-target-testing/jamvm/install/hotspot
HOTSPOT_SERVER_PATH = /notnfs/nighttester/icedtea7-target-testing/jamvm/install/hotspot/jre/lib/amd64/server
ALT_HOTSPOT_SERVER_PATH =
CACERTS_FILE = ./../src/share/lib/security/cacerts
ALT_CACERTS_FILE =
CUPS_HEADERS_PATH = /usr/include
ALT_CUPS_HEADERS_PATH =
OpenJDK-specific settings:
FREETYPE_HEADERS_PATH = /usr/include
ALT_FREETYPE_HEADERS_PATH =
FREETYPE_LIB_PATH = /usr/lib
ALT_FREETYPE_LIB_PATH =
Previous JDK Settings:
PREVIOUS_RELEASE_PATH = USING-PREVIOUS_RELEASE_IMAGE
ALT_PREVIOUS_RELEASE_PATH =
PREVIOUS_JDK_VERSION = 1.6.0
ALT_PREVIOUS_JDK_VERSION =
PREVIOUS_JDK_FILE =
ALT_PREVIOUS_JDK_FILE =
PREVIOUS_JRE_FILE =
ALT_PREVIOUS_JRE_FILE =
PREVIOUS_RELEASE_IMAGE = /notnfs/nighttester/icedtea7-target-testing/bootstrap/jdk1.6.0
ALT_PREVIOUS_RELEASE_IMAGE =
WARNING: You are not building the HOTSPOT sources.
Hotspot libs will be obtained from
the location set in ALT_HOTSPOT_IMPORT_PATH.
Sanity check passed.
/bin/gmake \
SKIP_FASTDEBUG_BUILD=true \
SKIP_DEBUG_BUILD=true \
\
generic_build_repo_series
gmake[3]: Entering directory `/notnfs/nighttester/icedtea7-target-testing/openjdk'
/bin/mkdir -p /notnfs/nighttester/icedtea7-target-testing/openjdk.build/j2sdk-image
/bin/mkdir -p /notnfs/nighttester/icedtea7-target-testing/openjdk.build/langtools
########################################################################
########################################################################
##### Entering langtools for target(s) all #####
########################################################################
(cd ./langtools/make && \
/bin/gmake JDK_TOPDIR=/notnfs/nighttester/icedtea7-target-testing/openjdk/jdk JDK_MAKE_SHARED_DIR=/notnfs/nighttester/icedtea7-target-testing/openjdk/jdk/make/common/shared EXTERNALSANITYCONTROL=true SOURCE_LANGUAGE_VERSION=7 TARGET_CLASS_VERSION=7 MILESTONE=fcs BUILD_NUMBER=b00 JDK_BUILD_NUMBER=b00 FULL_VERSION=1.7.0_131-b00 PREVIOUS_JDK_VERSION=1.6.0 JDK_VERSION=1.7.0_131 JDK_MKTG_VERSION=7u131 JDK_MAJOR_VERSION=1 JDK_MINOR_VERSION=7 JDK_MICRO_VERSION=0 PREVIOUS_MAJOR_VERSION=1 PREVIOUS_MINOR_VERSION=6 PREVIOUS_MICRO_VERSION=0 STATIC_CXX=false PAX_COMMAND=/usr/sbin/paxmark.sh PAX_COMMAND_ARGS="-vm" ARCH_DATA_MODEL=64 COOKED_JDK_UPDATE_VERSION=131 COOKED_BUILD_NUMBER=0 ALT_OUTPUTDIR=/notnfs/nighttester/icedtea7-target-testing/openjdk.build/langtools ALT_BOOTDIR=/notnfs/nighttester/icedtea7-target-testing/bootstrap/jdk1.6.0 all)
gmake[4]: Entering directory `/notnfs/nighttester/icedtea7-target-testing/openjdk/langtools/make'
JAVA_HOME=/notnfs/nighttester/icedtea7-target-testing/bootstrap/jdk1.6.0 ANT_OPTS=-Djava.io.tmpdir='/notnfs/nighttester/icedtea7-target-testing/openjdk.build/langtools/build/ant-tmp' /bin/ant -diagnostics > /notnfs/nighttester/icedtea7-target-testing/openjdk.build/langtools/build/ant-diagnostics.log ; \
JAVA_HOME=/notnfs/nighttester/icedtea7-target-testing/bootstrap/jdk1.6.0 ANT_OPTS=-Djava.io.tmpdir='/notnfs/nighttester/icedtea7-target-testing/openjdk.build/langtools/build/ant-tmp' /bin/ant -version >> /notnfs/nighttester/icedtea7-target-testing/openjdk.build/langtools/build/ant-diagnostics.log
JAVA_HOME=/notnfs/nighttester/icedtea7-target-testing/bootstrap/jdk1.6.0 ANT_OPTS=-Djava.io.tmpdir='/notnfs/nighttester/icedtea7-target-testing/openjdk.build/langtools/build/ant-tmp' /bin/ant -Djdk.version=1.7.0_131 -Dfull.version='1.7.0_131-b00' -Drelease=1.7.0_131 -Dbuild.number=b00 -Djavac.debug=true -Ddebug.classfiles=true -Djavac.warnings.fatal= -Djavac.target=7 -Djavac.source=7 -Dboot.java.home=/notnfs/nighttester/icedtea7-target-testing/bootstrap/jdk1.6.0 -Dimport.jdk=/notnfs/nighttester/icedtea7-target-testing/openjdk/jdk -Dbuild.dir=/notnfs/nighttester/icedtea7-target-testing/openjdk.build/langtools/build -Ddist.dir=/notnfs/nighttester/icedtea7-target-testing/openjdk.build/langtools/dist build
Buildfile: /notnfs/nighttester/icedtea7-target-testing/openjdk/langtools/make/build.xml
-def-pcompile:
[mkdir] Created dir: /notnfs/nighttester/icedtea7-target-testing/openjdk.build/langtools/build/toolclasses
[javac] Compiling 2 source files to /notnfs/nighttester/icedtea7-target-testing/openjdk.build/langtools/build/toolclasses
[javac] warning: [options] bootstrap class path not set in conjunction with -source 1.6
[javac] 1 warning
-def-build-classes:
-def-build-bootstrap-classes:
-def-build-jar:
-def-build-bootstrap-jar:
-def-check:
-check-boot.java.home:
-def-build-tool:
-def-build-bootstrap-tool:
build-bootstrap-javac:
[mkdir] Created dir: /notnfs/nighttester/icedtea7-target-testing/openjdk.build/langtools/build/bootstrap/gensrc
[mkdir] Created dir: /notnfs/nighttester/icedtea7-target-testing/openjdk.build/langtools/build/bootstrap/classes
[pcompile] Generating 7 resource files to /notnfs/nighttester/icedtea7-target-testing/openjdk.build/langtools/build/bootstrap/gensrc
[copy] Copying 1 file to /notnfs/nighttester/icedtea7-target-testing/openjdk.build/langtools/build/bootstrap/gensrc
[pcompile] Generating 1 resource files to /notnfs/nighttester/icedtea7-target-testing/openjdk.build/langtools/build/bootstrap/gensrc
[javac] Compiling 298 source files to /notnfs/nighttester/icedtea7-target-testing/openjdk.build/langtools/build/bootstrap/classes
[copy] Copying 1 file to /notnfs/nighttester/icedtea7-target-testing/openjdk.build/langtools/build/bootstrap/classes
[mkdir] Created dir: /notnfs/nighttester/icedtea7-target-testing/openjdk.build/langtools/build/bootstrap/lib
[jar] Building jar: /notnfs/nighttester/icedtea7-target-testing/openjdk.build/langtools/build/bootstrap/lib/javac.jar
[mkdir] Created dir: /notnfs/nighttester/icedtea7-target-testing/openjdk.build/langtools/build/bootstrap/bin
[copy] Copying 1 file to /notnfs/nighttester/icedtea7-target-testing/openjdk.build/langtools/build/bootstrap/bin
build-bootstrap-javadoc:
[pcompile] Generating 3 resource files to /notnfs/nighttester/icedtea7-target-testing/openjdk.build/langtools/build/bootstrap/gensrc
[javac] Compiling 74 source files to /notnfs/nighttester/icedtea7-target-testing/openjdk.build/langtools/build/bootstrap/classes
[javac] Note: Some input files use or override a deprecated API.
[javac] Note: Recompile with -Xlint:deprecation for details.
[jar] Building jar: /notnfs/nighttester/icedtea7-target-testing/openjdk.build/langtools/build/bootstrap/lib/javadoc.jar
[copy] Copying 1 file to /notnfs/nighttester/icedtea7-target-testing/openjdk.build/langtools/build/bootstrap/bin
build-bootstrap-doclets:
[pcompile] Generating 6 resource files to /notnfs/nighttester/icedtea7-target-testing/openjdk.build/langtools/build/bootstrap/gensrc
[javac] Compiling 149 source files to /notnfs/nighttester/icedtea7-target-testing/openjdk.build/langtools/build/bootstrap/classes
[javac] Note: Some input files use or override a deprecated API.
[javac] Note: Recompile with -Xlint:deprecation for details.
[copy] Copying 6 files to /notnfs/nighttester/icedtea7-target-testing/openjdk.build/langtools/build/bootstrap/classes
[jar] Building jar: /notnfs/nighttester/icedtea7-target-testing/openjdk.build/langtools/build/bootstrap/lib/doclets.jar
build-bootstrap-javah:
[pcompile] Generating 3 resource files to /notnfs/nighttester/icedtea7-target-testing/openjdk.build/langtools/build/bootstrap/gensrc
[copy] Copying 1 file to /notnfs/nighttester/icedtea7-target-testing/openjdk.build/langtools/build/bootstrap/gensrc
[pcompile] Generating 1 resource files to /notnfs/nighttester/icedtea7-target-testing/openjdk.build/langtools/build/bootstrap/gensrc
[javac] Compiling 16 source files to /notnfs/nighttester/icedtea7-target-testing/openjdk.build/langtools/build/bootstrap/classes
[jar] Building jar: /notnfs/nighttester/icedtea7-target-testing/openjdk.build/langtools/build/bootstrap/lib/javah.jar
[copy] Copying 1 file to /notnfs/nighttester/icedtea7-target-testing/openjdk.build/langtools/build/bootstrap/bin
build-bootstrap-tools:
-def-genstubs:
-create-import-jdk-stubs:
build-all-classes:
[mkdir] Created dir: /notnfs/nighttester/icedtea7-target-testing/openjdk.build/langtools/build/gensrc
[mkdir] Created dir: /notnfs/nighttester/icedtea7-target-testing/openjdk.build/langtools/build/classes
[pcompile] Generating 25 resource files to /notnfs/nighttester/icedtea7-target-testing/openjdk.build/langtools/build/gensrc
[copy] Copying 3 files to /notnfs/nighttester/icedtea7-target-testing/openjdk.build/langtools/build/gensrc
[pcompile] Generating 3 resource files to /notnfs/nighttester/icedtea7-target-testing/openjdk.build/langtools/build/gensrc
[javac] Compiling 718 source files to /notnfs/nighttester/icedtea7-target-testing/openjdk.build/langtools/build/classes
[javac] /notnfs/nighttester/icedtea7-target-testing/openjdk/langtools/src/share/classes/com/sun/tools/javac/util/Names.java:292: error: no suitable method found for fromUtf(byte[])
[javac] return table.fromUtf(cs);
[javac] ^
[javac] method Table.fromUtf(byte[],int,int) is not applicable
[javac] (actual and formal argument lists differ in length)
[javac] method Table.fromUtf() is not applicable
[javac] (actual and formal argument lists differ in length)
[javac] Note: Some input files use or override a deprecated API.
[javac] Note: Recompile with -Xlint:deprecation for details.
[javac] 1 error
BUILD FAILED
/notnfs/nighttester/icedtea7-target-testing/openjdk/langtools/make/build.xml:250: The following error occurred while executing this line:
/notnfs/nighttester/icedtea7-target-testing/openjdk/langtools/make/build.xml:795: Compile failed; see the compiler error output for details.
Total time: 46 seconds
gmake[4]: *** [build] Error 1
gmake[4]: Leaving directory `/notnfs/nighttester/icedtea7-target-testing/openjdk/langtools/make'
gmake[3]: *** [langtools-build] Error 2
gmake[3]: Leaving directory `/notnfs/nighttester/icedtea7-target-testing/openjdk'
gmake[2]: *** [build_product_image] Error 2
gmake[2]: Leaving directory `/notnfs/nighttester/icedtea7-target-testing/openjdk'
gmake[1]: *** [jdk_only] Error 2
gmake[1]: Leaving directory `/notnfs/nighttester/icedtea7-target-testing/openjdk'
make: *** [stamps/icedtea.stamp] Error 2
+ exit 1
Build step 'Execute shell' marked build as failure
More information about the icedtea-test
mailing list