git: openjdk/jdk11u: 258 new changesets

Christoph Langer clanger at openjdk.java.net
Wed Nov 3 14:48:08 UTC 2021


Changeset: 0ea1e0fe
Author:    Goetz Lindenmaier <goetz at openjdk.org>
Date:      2021-08-31 20:33:46 +0000
URL:       https://git.openjdk.java.net/jdk11u/commit/0ea1e0fe7ab4449fa137a25c39d38e6694b599bc

8272902: Bump update version for OpenJDK: jdk-11.0.14

Reviewed-by: clanger

! .jcheck/conf
! make/autoconf/version-numbers

Changeset: d41b37ff
Author:    Matthias Baesken <mbaesken at openjdk.org>
Date:      2021-09-01 09:03:45 +0000
URL:       https://git.openjdk.java.net/jdk11u/commit/d41b37ff9f5af31796b36825b5e266afd4b99a18

8263362: Avoid division by 0 in  java/awt/font/TextJustifier.java justify

Backport-of: ea30bd6684fa3003889062a129a5aee1bc9b0024

! src/java.desktop/share/classes/java/awt/font/TextJustifier.java

Changeset: 9a5ba0b9
Author:    Martin Doerr <mdoerr at openjdk.org>
Date:      2021-09-02 14:28:06 +0000
URL:       https://git.openjdk.java.net/jdk11u/commit/9a5ba0b995e25ebcb0e196c9df4412040df36b2c

7179006: [macosx] Print-to-file doesn't work: printing to the default printer instead

Reviewed-by: clanger
Backport-of: ea7c47c1bb51d079aff44b88f94b3fe5c76fbce5

! src/java.desktop/macosx/classes/sun/lwawt/macosx/CPrinterJob.java
! src/java.desktop/macosx/native/libawt_lwawt/awt/CPrinterJob.m
! test/jdk/java/awt/print/Dialog/PrintDlgApp.java
+ test/jdk/java/awt/print/PrinterJob/PrintToFileTest.java

Changeset: ea1a1d86
Author:    Martin Doerr <mdoerr at openjdk.org>
Date:      2021-09-02 14:43:10 +0000
URL:       https://git.openjdk.java.net/jdk11u/commit/ea1a1d86b92e43bbb4ecadf4ba3bd338b3441ad4

8251377: [macos11] JTabbedPane selected tab text is barely legible

Reviewed-by: shade
Backport-of: 3f67afd3a8c642f33ca58a9881dff4c81f83e821

! src/java.desktop/macosx/classes/apple/laf/JRSUIUtils.java
! src/java.desktop/macosx/classes/com/apple/laf/AquaImageFactory.java
! src/java.desktop/macosx/classes/com/apple/laf/AquaLookAndFeel.java
! src/java.desktop/macosx/classes/sun/lwawt/macosx/LWCToolkit.java
! src/java.desktop/macosx/native/libawt_lwawt/awt/CSystemColors.m

Changeset: 2908bbd2
Author:    Vladimir Kempik <vkempik at openjdk.org>
Date:      2021-09-03 06:32:18 +0000
URL:       https://git.openjdk.java.net/jdk11u/commit/2908bbd2595e7a3ba1a4c0d42629e72e72cccdeb

8270216: [macOS] Update named used for Java run loop mode

Backport-of: 254600658acbc5c40ae8f0de0d01c9906c67c46c

! src/java.desktop/macosx/native/libosxapp/ThreadUtilities.m

Changeset: 9efd897e
Author:    Sergey Nazarkin <snazarki at openjdk.org>
Committer: Vladimir Kempik <vkempik at openjdk.org>
Date:      2021-09-03 08:47:01 +0000
URL:       https://git.openjdk.java.net/jdk11u/commit/9efd897ed2bd3865b52b85d7064c6293ce69ed6b

8261236: C2: ClhsdbJstackXcompStress test fails when StressGCM is enabled

Reviewed-by: phh
Backport-of: 752b6df34c92c02ac0992566e3efa7bc22b96aa1

! src/jdk.hotspot.agent/share/classes/sun/jvm/hotspot/compiler/ImmutableOopMapSet.java
! src/jdk.hotspot.agent/share/classes/sun/jvm/hotspot/compiler/OopMapStream.java
! src/jdk.hotspot.agent/share/classes/sun/jvm/hotspot/ui/classbrowser/HTMLGenerator.java

Changeset: 1645dbe4
Author:    Martin Doerr <mdoerr at openjdk.org>
Date:      2021-09-04 13:34:57 +0000
URL:       https://git.openjdk.java.net/jdk11u/commit/1645dbe4df6e5238446868b7277138ed7ce271f6

8262731: [macOS] Exception from "Printable.print" is swallowed during "PrinterJob.print"

Backport-of: c0b4407d09a7bf9f15553dc5344b1e354b150d57

! src/java.desktop/macosx/classes/sun/lwawt/macosx/CPrinterJob.java
+ test/jdk/java/awt/print/PrinterJob/ExceptionFromPrintableIsIgnoredTest.java

Changeset: 569688f5
Author:    Matthias Baesken <mbaesken at openjdk.org>
Date:      2021-09-06 13:37:54 +0000
URL:       https://git.openjdk.java.net/jdk11u/commit/569688f56d0ef1d688226b0d474f7a886851956f

8272316: Wrong Boot JDK help message in 11

Reviewed-by: stuefe

! make/autoconf/help.m4

Changeset: 47e4bc9e
Author:    Martin Doerr <mdoerr at openjdk.org>
Date:      2021-09-07 09:17:10 +0000
URL:       https://git.openjdk.java.net/jdk11u/commit/47e4bc9eb9457dcf3e4793936e8c82fe2e1e5ff9

8269984: [macos] JTabbedPane title looks like  disabled

Reviewed-by: goetz, serb
Backport-of: 8adf008b150bfda783ae615965198edb4d196016

! src/java.desktop/macosx/classes/apple/laf/JRSUIUtils.java

Changeset: 2de01c1e
Author:    Christoph Langer <clanger at openjdk.org>
Date:      2021-09-07 13:37:49 +0000
URL:       https://git.openjdk.java.net/jdk11u/commit/2de01c1e762d9484f4ff33e9f5036b0d69b085a1

8269993: [Test]: java/net/httpclient/DigestEchoClientSSL.java contains redundant @run tags

Backport-of: 4e18ec26ddfa0b44e8780ebd556a5e8aa2e90dc0

! test/jdk/java/net/httpclient/DigestEchoClientSSL.java

Changeset: 085dbe32
Author:    Bin Liao <buddyliao at tencent.com>
Committer: Christoph Langer <clanger at openjdk.org>
Date:      2021-09-08 05:12:19 +0000
URL:       https://git.openjdk.java.net/jdk11u/commit/085dbe326db0684bee22719094ff7e719f9aacb0

8215624: Add parallel heap iteration for jmap –histo
8253763: ParallelObjectIterator should have virtual destructor

Chunk and parallelize the heap scan

Reviewed-by: clanger
Backport-of: 3498a10a2b4cfcdf219b4433124a2358eb6100c9

! src/hotspot/share/gc/cms/cmsHeap.hpp
! src/hotspot/share/gc/epsilon/epsilonHeap.hpp
! src/hotspot/share/gc/g1/g1CollectedHeap.cpp
! src/hotspot/share/gc/g1/g1CollectedHeap.hpp
! src/hotspot/share/gc/parallel/parallelScavengeHeap.cpp
! src/hotspot/share/gc/parallel/parallelScavengeHeap.hpp
! src/hotspot/share/gc/serial/serialHeap.hpp
! src/hotspot/share/gc/shared/collectedHeap.hpp
! src/hotspot/share/gc/shared/vmGCOperations.cpp
! src/hotspot/share/gc/shared/vmGCOperations.hpp
! src/hotspot/share/gc/shenandoah/shenandoahHeap.hpp
! src/hotspot/share/gc/z/zCollectedHeap.hpp
! src/hotspot/share/memory/heapInspection.cpp
! src/hotspot/share/memory/heapInspection.hpp
! src/hotspot/share/runtime/arguments.hpp
! src/hotspot/share/services/attachListener.cpp
! src/jdk.jcmd/share/classes/sun/tools/jmap/JMap.java
! test/jdk/sun/tools/jmap/BasicJMapTest.java

Changeset: 1d1e4ce7
Author:    Bin Liao <buddyliao at tencent.com>
Committer: Christoph Langer <clanger at openjdk.org>
Date:      2021-09-08 06:28:59 +0000
URL:       https://git.openjdk.java.net/jdk11u/commit/1d1e4ce7392db602538e58b3d0dd45b7b598b83b

8251570: JDK-8215624 causes assert(worker_id < _n_workers) failed: Invalid worker_id

Reviewed-by: rschmelter, clanger
Backport-of: 2631422bc55c8a411e170c5bf737a1882a61d2f5

! src/hotspot/share/gc/cms/cmsHeap.hpp
! src/hotspot/share/gc/epsilon/epsilonHeap.hpp
! src/hotspot/share/gc/g1/g1CollectedHeap.cpp
! src/hotspot/share/gc/g1/g1CollectedHeap.hpp
! src/hotspot/share/gc/parallel/parallelScavengeHeap.cpp
! src/hotspot/share/gc/parallel/parallelScavengeHeap.hpp
! src/hotspot/share/gc/serial/serialHeap.hpp
! src/hotspot/share/gc/shared/collectedHeap.hpp
! src/hotspot/share/gc/shared/workgroup.hpp
! src/hotspot/share/gc/shenandoah/shenandoahHeap.hpp
! src/hotspot/share/gc/z/zCollectedHeap.hpp
! src/hotspot/share/memory/heapInspection.cpp

Changeset: c88867ce
Author:    Aleksey Shipilev <shade at openjdk.org>
Date:      2021-09-08 14:53:40 +0000
URL:       https://git.openjdk.java.net/jdk11u/commit/c88867ce0052368e243ffea321fd7c19770d10e0

8248899: security/infra/java/security/cert/CertPathValidator/certification/QuoVadisCA.java fails, Certificate has been revoked

Reviewed-by: phh
Backport-of: d6bb846159be7e46fba0c3ca2915617f945e0b42

! test/jdk/ProblemList.txt
! test/jdk/security/infra/java/security/cert/CertPathValidator/certification/QuoVadisCA.java

Changeset: ae0d088e
Author:    Clive Verghese <cverghese at openjdk.org>
Committer: Paul Hohensee <phh at openjdk.org>
Date:      2021-09-09 19:23:11 +0000
URL:       https://git.openjdk.java.net/jdk11u/commit/ae0d088ecee7cc7177ec60aa771a23c49d22ae31

8270317: Large Allocation in CipherSuite

Backport-of: e627caec84c169c99c04e0d355c29b806a0266ed

! src/java.base/share/classes/sun/security/ssl/CipherSuite.java
+ test/micro/org/openjdk/bench/java/security/CipherSuiteBench.java

Changeset: cf95c4cf
Author:    Christoph Langer <clanger at openjdk.org>
Date:      2021-09-09 20:14:48 +0000
URL:       https://git.openjdk.java.net/jdk11u/commit/cf95c4cf0c7be0de3d0e61d19a5b14f6615e202b

8206085: Refactor langtools/tools/javac/versions/Versions.java

Reviewed-by: phh
Backport-of: 28e2dea71d24962aeb3a26166dbb55ebe8f30ca6

! test/langtools/tools/javac/versions/Versions.java

Changeset: 8da3a003
Author:    Vladimir Kempik <vkempik at openjdk.org>
Date:      2021-09-09 20:26:03 +0000
URL:       https://git.openjdk.java.net/jdk11u/commit/8da3a003be49f2ed3cf000ee47c82dcd6395faed

8251930: AArch64: Native types mismatch in hotspot

Reviewed-by: phh
Backport-of: f1e07806686a837f744e279b6b11394be88c0818

! src/hotspot/cpu/aarch64/aarch64.ad
! src/hotspot/cpu/aarch64/assembler_aarch64.cpp
! src/hotspot/cpu/aarch64/assembler_aarch64.hpp
! src/hotspot/cpu/aarch64/macroAssembler_aarch64.cpp
! src/hotspot/cpu/aarch64/macroAssembler_aarch64.hpp

Changeset: a013fe28
Author:    Christoph Langer <clanger at openjdk.org>
Date:      2021-09-10 06:37:03 +0000
URL:       https://git.openjdk.java.net/jdk11u/commit/a013fe28b146c90feaa5756251f3f0c1d10bae83

8210395: Add doc to SecurityTools.java

Reviewed-by: phh
Backport-of: 5cf91fc60e90bf03e113966760666adaf6d65798

! test/lib/jdk/test/lib/SecurityTools.java
! test/lib/jdk/test/lib/util/JarUtils.java

Changeset: a39375ef
Author:    Martin Doerr <mdoerr at openjdk.org>
Date:      2021-09-10 09:23:16 +0000
URL:       https://git.openjdk.java.net/jdk11u/commit/a39375ef0269b1a2d8614282b27d0f4a09c649c3

8256372: [macos] Unexpected symbol was displayed on JTextField with Monospaced font

Reviewed-by: clanger
Backport-of: 005d8a7fca8b4d9519d2bde0a7cdbbece1cd3981

! make/lib/Awt2dLibraries.gmk
! src/java.desktop/macosx/classes/sun/font/CFont.java
! src/java.desktop/share/classes/sun/font/SunLayoutEngine.java
! src/java.desktop/share/native/libfontmanager/HBShaper.c
! src/java.desktop/share/native/libfontmanager/hb-jdk-font.cc
! src/java.desktop/share/native/libfontmanager/hb-jdk.h
- src/java.desktop/share/native/libharfbuzz/hb-coretext.cc
- src/java.desktop/share/native/libharfbuzz/hb-coretext.h
+ test/jdk/java/awt/font/GlyphVector/NLGlyphTest.java

Changeset: 4ea2edd7
Author:    Martin Doerr <mdoerr at openjdk.org>
Date:      2021-09-10 09:24:21 +0000
URL:       https://git.openjdk.java.net/jdk11u/commit/4ea2edd7a3a3ad2d94da1bfb0d8ebc65ebf4b878

8260690: JConsole User Guide Link from the Help menu is not accessible by keyboard

Backport-of: b5d32bbfc716870904e91ce07a09f08929f2563e

! src/jdk.jconsole/share/classes/sun/tools/jconsole/AboutDialog.java

Changeset: 1e6682a7
Author:    Martin Doerr <mdoerr at openjdk.org>
Date:      2021-09-10 09:25:16 +0000
URL:       https://git.openjdk.java.net/jdk11u/commit/1e6682a730675d8f41d0efd50afaf4d7e7475056

8247403: JShell: No custom input (e.g. from GUI) possible with JavaShellToolBuilder

Reviewed-by: clanger
Backport-of: 2c8e94f6804fee269a882a3e92b7ce844451eb11

! src/jdk.internal.le/share/classes/jdk/internal/org/jline/reader/impl/LineReaderImpl.java
! src/jdk.jshell/share/classes/jdk/internal/jshell/tool/ConsoleIOContext.java
! src/jdk.jshell/share/classes/jdk/internal/jshell/tool/JShellTool.java
! src/jdk.jshell/share/classes/jdk/internal/jshell/tool/JShellToolBuilder.java
! src/jdk.jshell/share/classes/jdk/jshell/tool/JavaShellToolBuilder.java
+ test/langtools/jdk/jshell/CustomInputToolBuilder.java
! test/langtools/jdk/jshell/HistoryUITest.java
! test/langtools/jdk/jshell/PasteAndMeasurementsUITest.java
! test/langtools/jdk/jshell/ToolMultilineSnippetHistoryTest.java
! test/langtools/jdk/jshell/ToolShiftTabTest.java
! test/langtools/jdk/jshell/ToolTabCommandTest.java
! test/langtools/jdk/jshell/ToolTabSnippetTest.java
! test/langtools/jdk/jshell/UITesting.java

Changeset: bfb52f28
Author:    Severin Gehwolf <sgehwolf at openjdk.org>
Date:      2021-09-10 13:38:30 +0000
URL:       https://git.openjdk.java.net/jdk11u/commit/bfb52f28c8ceaa199de5b06d23e60376038f3420

8273547: [11u] [JVMCI] Partial module-info.java backport of JDK-8223332

Reviewed-by: clanger

! src/jdk.internal.vm.ci/share/classes/module-info.java
! test/jdk/jdk/modules/etc/JdkQualifiedExportTest.java

Changeset: 180bc526
Author:    Sergey Bylokhov <serb at openjdk.org>
Date:      2021-09-10 17:39:08 +0000
URL:       https://git.openjdk.java.net/jdk11u/commit/180bc526b025e815b43070150369ae399e27753f

8272966: test/jdk/java/awt/Robot/FlushCurrentEvent.java fails by timeout

Reviewed-by: clanger

! test/jdk/java/awt/Robot/FlushCurrentEvent.java

Changeset: 5a5d246a
Author:    Christoph Langer <clanger at openjdk.org>
Date:      2021-09-11 05:37:46 +0000
URL:       https://git.openjdk.java.net/jdk11u/commit/5a5d246a8c1c96bcb2a2f35cb18a5783f16498c5

8195703: BasicJDWPConnectionTest.java: 'App exited unexpectedly with 2'

Reviewed-by: phh, amenkov
Backport-of: 24fb839864c441594b1fa0f2a20366581d45a7ac

! test/jdk/ProblemList.txt
! test/jdk/com/sun/jdi/BasicJDWPConnectionTest.java
! test/jdk/com/sun/jdi/DoubleAgentTest.java
! test/lib/jdk/test/lib/apps/LingeredApp.java

Changeset: dee030c0
Author:    Christoph Langer <clanger at openjdk.org>
Date:      2021-09-11 05:38:50 +0000
URL:       https://git.openjdk.java.net/jdk11u/commit/dee030c02b76f1e6ec15bf2e0a56c754186df110

8210353: Move java/util/Arrays/TimSortStackSize2.java back to tier1

Backport-of: a0594bc1380c85420fc87e9136c55d2b8c7ab7a1

! test/jdk/TEST.groups
! test/jdk/java/util/Arrays/TimSortStackSize2.java

Changeset: 90ecf27b
Author:    Christoph Langer <clanger at openjdk.org>
Date:      2021-09-11 05:41:30 +0000
URL:       https://git.openjdk.java.net/jdk11u/commit/90ecf27b054452bd0b194f6b465656c9122c34f3

8213263: fix legal headers in test/langtools

Reviewed-by: mdoerr
Backport-of: 73fa99ae866defd67cae7604fca012825c82283e

! src/jdk.jfr/share/classes/jdk/jfr/events/X509CertificateEvent.java
! test/langtools/jdk/javadoc/doclet/testCopyFiles/modules/acme.mdle/module-info.java
! test/langtools/jdk/javadoc/doclet/testCopyFiles/modules/acme.mdle/p/Foo.java
! test/langtools/jdk/javadoc/doclet/testCopyFiles/modules/acme.mdle/p/doc-files/inpackage.html
! test/langtools/jdk/javadoc/doclet/testCopyFiles/modules/acme.mdle/p/doc-files/sub-dir/SubReadme.html
! test/langtools/jdk/javadoc/doclet/testCopyFiles/modules/acme.mdle/p/doc-files/sub-dir/sub-dir-1/SubSubReadme.html
! test/langtools/jdk/javadoc/doclet/testCopyFiles/modules/acme.mdle/p/package.html
! test/langtools/jdk/javadoc/doclet/testCopyFiles/modules/acme2.mdle/module-info.java
! test/langtools/jdk/javadoc/doclet/testCopyFiles/modules/acme2.mdle/p2/Foo.java
! test/langtools/jdk/javadoc/doclet/testCopyFiles/modules/acme2.mdle/p2/doc-files/inpackage.html
! test/langtools/jdk/javadoc/doclet/testCopyFiles/modules/acme2.mdle/p2/doc-files/sub-dir/SubReadme.html
! test/langtools/jdk/javadoc/doclet/testCopyFiles/modules/acme2.mdle/p2/doc-files/sub-dir/sub-dir-1/SubSubReadme.html
! test/langtools/jdk/javadoc/doclet/testCopyFiles/modules/acme2.mdle/p2/package.html
! test/langtools/jdk/javadoc/doclet/testCopyFiles/modules/overview.html
! test/langtools/jdk/javadoc/doclet/testCopyFiles/packages/p1/Foo.java
! test/langtools/jdk/javadoc/doclet/testCopyFiles/packages/p1/doc-files/inpackage.html
! test/langtools/jdk/javadoc/doclet/testCopyFiles/packages/p1/doc-files/sub-dir/SubReadme.html
! test/langtools/jdk/javadoc/doclet/testCopyFiles/packages/p2/Foo.java
! test/langtools/jdk/javadoc/doclet/testCopyFiles/packages/p2/doc-files/case1.html
! test/langtools/jdk/javadoc/doclet/testCopyFiles/packages/p2/doc-files/case2.html
! test/langtools/jdk/javadoc/doclet/testCopyFiles/packages/p2/doc-files/case3.html
! test/langtools/jdk/javadoc/doclet/testCopyFiles/packages/p2/doc-files/case4.html
! test/langtools/jdk/javadoc/doclet/testCopyFiles/unnamed/Foo.java
! test/langtools/jdk/javadoc/doclet/testCopyFiles/unnamed/doc-files/doc-file/SubReadme.html
! test/langtools/jdk/javadoc/doclet/testCopyFiles/unnamed/doc-files/inpackage.html
! test/langtools/jdk/javadoc/doclet/testGrandParentTypes/TestGrandParentTypes.java
! test/langtools/jdk/javadoc/doclet/testHtmlTag/pkg3/A.java
! test/langtools/jdk/javadoc/doclet/testHtmlTag/pkg3/package.html
! test/langtools/jdk/javadoc/doclet/testModules/moduleA/concealedpkgmdlA/ConcealedClassInModuleA.java
! test/langtools/jdk/javadoc/doclet/testModules/moduleA/module-info.java
! test/langtools/jdk/javadoc/doclet/testModules/moduleA/testpkgmdlA/TestClassInModuleA.java
! test/langtools/jdk/javadoc/doclet/testModules/moduleB/module-info.java
! test/langtools/jdk/javadoc/doclet/testModules/moduleB/testpkg2mdlB/TestInterface2InModuleB.java
! test/langtools/jdk/javadoc/doclet/testModules/moduleB/testpkg2mdlB/TestInterfaceInModuleB.java
! test/langtools/jdk/javadoc/doclet/testModules/moduleB/testpkg3mdlB/TestClassLinkOption.java
! test/langtools/jdk/javadoc/doclet/testModules/moduleB/testpkgmdlB/TestClass2InModuleB.java
! test/langtools/jdk/javadoc/doclet/testModules/moduleB/testpkgmdlB/TestClassInModuleB.java
! test/langtools/jdk/javadoc/doclet/testModules/moduleC/module-info.java
! test/langtools/jdk/javadoc/doclet/testModules/moduleC/testpkgmdlC/TestClassInModuleC.java
! test/langtools/jdk/javadoc/doclet/testModules/moduleNoExport/module-info.java
! test/langtools/jdk/javadoc/doclet/testModules/moduleNoExport/testpkgmdlNoExport/TestClassInModuleNoExport.java
! test/langtools/jdk/javadoc/doclet/testModules/moduleT/module-info.java
! test/langtools/jdk/javadoc/doclet/testModules/moduletags/module-info.java
! test/langtools/jdk/javadoc/doclet/testModules/moduletags/testpkgmdltags/TestClassInModuleTags.java
! test/langtools/jdk/javadoc/doclet/testModules/test.moduleFullName/module-info.java
! test/langtools/jdk/javadoc/doclet/testModules/test.moduleFullName/testpkgmdlfullname/TestClassInTestModuleFullName.java
! test/langtools/jdk/javadoc/doclet/testModules/testpkgnomodule/TestClassNoModule.java
! test/langtools/jdk/javadoc/doclet/testModules/testpkgnomodule1/TestClassNoModulePkg1.java
! test/langtools/jdk/javadoc/doclet/testOverriddenMethods/pkg5/TestEnum.java
! test/langtools/jdk/javadoc/doclet/testOverview/msrc/module-info.java
! test/langtools/jdk/javadoc/doclet/testPackageDescription/pkg/package-info.java
! test/langtools/jdk/javadoc/doclet/testSummaryTag/TestSummaryTag.java
! test/langtools/jdk/javadoc/doclet/testValueTag/pkg3/RT.java
! test/langtools/jdk/javadoc/tool/TestScriptInComment.java
! test/langtools/tools/javac/8133247/T8133247.java
! test/langtools/tools/javac/8133247/p/A.java
! test/langtools/tools/javac/8133247/p/B.java
! test/langtools/tools/javac/8133247/p/I.java
! test/langtools/tools/javac/8169345/T8169345b.java
! test/langtools/tools/javac/8169345/T8169345c.java
! test/langtools/tools/javac/DefiniteAssignment/T8204610.java
! test/langtools/tools/javac/annotations/8145489/foo/Anno.java
! test/langtools/tools/javac/annotations/8145489/foo/Status.java
! test/langtools/tools/javac/annotations/8145489/foo/package-info.java
! test/langtools/tools/javac/classreader/8171132/BadConstantValue.java
! test/langtools/tools/javac/diags/examples/FutureVarNotAllowed.java
! test/langtools/tools/javac/diags/examples/IllegalRefToVarType.java
! test/langtools/tools/javac/diags/examples/IllegalSignature.java
! test/langtools/tools/javac/diags/examples/LocalCantInferNull.java
! test/langtools/tools/javac/diags/examples/LocalCantInferVoid.java
! test/langtools/tools/javac/diags/examples/LocalLambdaMissingTarget.java
! test/langtools/tools/javac/diags/examples/LocalMissingInit.java
! test/langtools/tools/javac/diags/examples/LocalMrefMissingTarget.java
! test/langtools/tools/javac/diags/examples/LocalRedundantType.java
! test/langtools/tools/javac/diags/examples/LocalSelfRef.java
! test/langtools/tools/javac/diags/examples/PreviewFeatureDisabled.java
! test/langtools/tools/javac/diags/examples/PreviewFeatureDisabledPlural.java
! test/langtools/tools/javac/diags/examples/PreviewFeatureUse.java
! test/langtools/tools/javac/diags/examples/PreviewFilename.java
! test/langtools/tools/javac/diags/examples/PreviewFilenameAdditional.java
! test/langtools/tools/javac/diags/examples/PreviewPlural/PreviewPlural.java
! test/langtools/tools/javac/diags/examples/PreviewPlural/PreviewPluralBar.java
! test/langtools/tools/javac/diags/examples/StatExprExpected.java
! test/langtools/tools/javac/diags/examples/VarNotAllowed.java
! test/langtools/tools/javac/diags/examples/VarNotAllowedArray.java
! test/langtools/tools/javac/diags/examples/VarNotAllowedCompound.java
! test/langtools/tools/javac/diags/examples/VarNotAllowedExplicitLambda.java
! test/langtools/tools/javac/diags/examples/VarNotAllowedHere.java
! test/langtools/tools/javac/diags/examples/WrongNumberTypeArgsFragment.java
! test/langtools/tools/javac/doctree/SummaryTest.java
! test/langtools/tools/javac/generics/diamond/7002837/T7002837.java
! test/langtools/tools/javac/generics/diamond/neg/T8078473.java
! test/langtools/tools/javac/generics/diamond/neg/T8078473_2.java
! test/langtools/tools/javac/generics/inference/8067767/T8067767.java
! test/langtools/tools/javac/generics/inference/8077306/T8077306.java
! test/langtools/tools/javac/generics/inference/8141613/T8141613.java
! test/langtools/tools/javac/generics/inference/8147493/T8147493a.java
! test/langtools/tools/javac/generics/inference/8147493/T8147493b.java
! test/langtools/tools/javac/generics/inference/8152832/T8152832.java
! test/langtools/tools/javac/generics/inference/8156954/T8156954.java
! test/langtools/tools/javac/generics/inference/8157149/T8157149b.java
! test/langtools/tools/javac/generics/inference/8157149/T8157149c.java
! test/langtools/tools/javac/generics/inference/8158355/T8158355.java
! test/langtools/tools/javac/generics/inference/8159680/T8159680.java
! test/langtools/tools/javac/generics/inference/8164399/T8164399.java
! test/langtools/tools/javac/generics/inference/8168134/T8168134.java
! test/langtools/tools/javac/generics/inference/8174249/T8174249a.java
! test/langtools/tools/javac/generics/inference/8174249/T8174249b.java
! test/langtools/tools/javac/generics/inference/8176534/TestUncheckedCalls.java
! test/langtools/tools/javac/generics/inference/8177097/T8177097a.java
! test/langtools/tools/javac/generics/inference/8177097/T8177097b.java
! test/langtools/tools/javac/generics/inference/8178150/T8178150.java
! test/langtools/tools/javac/generics/inference/8178427/T8178427.java
! test/langtools/tools/javac/lambda/8063054/T8063054a.java
! test/langtools/tools/javac/lambda/8063054/T8063054b.java
! test/langtools/tools/javac/lambda/8134329/T8134329.java
! test/langtools/tools/javac/lambda/8142876/T8142876.java
! test/langtools/tools/javac/lambda/8148128/T8148128.java
! test/langtools/tools/javac/lambda/8188144/T8188144.java
! test/langtools/tools/javac/lambda/8210495/T8210495.java
! test/langtools/tools/javac/lambda/T8195598.java
! test/langtools/tools/javac/lambda/speculative/8147546/T8147546a.java
! test/langtools/tools/javac/lambda/speculative/8147546/T8147546b.java
! test/langtools/tools/javac/lambda/speculative/8154180/T8154180a.java
! test/langtools/tools/javac/lambda/speculative/InferStrict.java
! test/langtools/tools/javac/lambda/speculative/InferWeak.java
! test/langtools/tools/javac/lambda/speculative/NestedLambdaGenerics.java
! test/langtools/tools/javac/lambda/speculative/NestedLambdaNoGenerics.java
! test/langtools/tools/javac/lambda/speculative/T8046685.java
! test/langtools/tools/javac/lambda/speculative/T8055984.java
! test/langtools/tools/javac/lambda/speculative/T8077247.java
! test/langtools/tools/javac/lambda/speculative/T8078093.java
! test/langtools/tools/javac/lvti/T8191893.java
! test/langtools/tools/javac/lvti/T8191959.java
! test/langtools/tools/javac/lvti/T8200199.java
! test/langtools/tools/javac/lvti/T8200199.out
! test/langtools/tools/javac/lvti/TestBadArray.java
! test/langtools/tools/javac/lvti/badTypeReference/BadTypeReference.java
! test/langtools/tools/javac/lvti/badTypeReference/BadTypeReference.out
! test/langtools/tools/javac/lvti/badTypeReference/pkg/nested/var/A.java
! test/langtools/tools/javac/lvti/badTypeReference/pkg/var.java
! test/langtools/tools/javac/lvti/harness/InferredType.java
! test/langtools/tools/javac/lvti/harness/LocalVariableInferenceTester.java
! test/langtools/tools/javac/lvti/harness/NonDenotableTest.java
! test/langtools/tools/javac/lvti/harness/PrimitiveTypeTest.java
! test/langtools/tools/javac/lvti/harness/ReferenceTypeTest.java
! test/langtools/tools/javac/lvti/harness/UpperBounds.java
! test/langtools/tools/javac/modules/T8168854/pack1/Outer.java
! test/langtools/tools/javac/modules/T8168854/pack1/Outer1.java
! test/langtools/tools/javac/overload/T8176265.java
! test/langtools/tools/javac/preview/PreviewOptionTest.java
! test/langtools/tools/javac/preview/classReaderTest/Bar.java
! test/langtools/tools/javadoc/lib/ToyDoclet.java
! test/langtools/tools/javap/typeAnnotations/InvisibleParameterAnnotationsTest.java
! test/langtools/tools/lib/builder/AbstractBuilder.java
! test/langtools/tools/lib/builder/ClassBuilder.java
! test/langtools/tools/lib/toolbox/Assert.java
! test/langtools/tools/sjavac/HiddenFiles.java
! test/langtools/tools/sjavac/OverlappingSrcDst.java

Changeset: 126f1a29
Author:    Christoph Langer <clanger at openjdk.org>
Date:      2021-09-11 05:42:39 +0000
URL:       https://git.openjdk.java.net/jdk11u/commit/126f1a29e2a625136b986f8fda738c16c312ed9b

8225083: Remove Google certificate that is expiring in December 2021

Backport-of: 1cbf41a87b153c010c51fdbae832e00314422193

- make/data/cacerts/globalsignr2ca
! test/jdk/sun/security/lib/cacerts/VerifyCACerts.java

Changeset: 1868c15d
Author:    Bin Liao <buddyliao at tencent.com>
Committer: Christoph Langer <clanger at openjdk.org>
Date:      2021-09-13 13:31:49 +0000
URL:       https://git.openjdk.java.net/jdk11u/commit/1868c15d4e5d03895a4a07edacd864021dfbac57

8237354: Add option to jcmd to write a gzipped heap dump

Reviewed-by: rschmelter, clanger
Backport-of: 19be49714356f2f598924c9fefa6358679ab6dbe

! src/hotspot/share/gc/shared/workgroup.cpp
! src/hotspot/share/gc/shared/workgroup.hpp
! src/hotspot/share/services/diagnosticCommand.cpp
! src/hotspot/share/services/diagnosticCommand.hpp
! src/hotspot/share/services/heapDumper.cpp
! src/hotspot/share/services/heapDumper.hpp
+ src/hotspot/share/services/heapDumperCompression.cpp
+ src/hotspot/share/services/heapDumperCompression.hpp
! src/java.base/share/native/libzip/zip_util.c
+ test/hotspot/jtreg/serviceability/dcmd/gc/HeapDumpCompressedTest.java
+ test/lib/jdk/test/lib/hprof/parser/GzipRandomAccess.java
! test/lib/jdk/test/lib/hprof/parser/HprofReader.java
! test/lib/jdk/test/lib/hprof/parser/Reader.java

Changeset: 4af62d83
Author:    Aleksey Shipilev <shade at openjdk.org>
Date:      2021-09-14 07:47:50 +0000
URL:       https://git.openjdk.java.net/jdk11u/commit/4af62d839720326eb24a554f82b0bfdabc19454f

8250863: Build error with GCC 10 in NetworkInterface.c and k_standard.c

Backport-of: e3c6574ac042642a5b30b96b945d86e709ba2a6b

! src/java.base/share/native/libfdlibm/k_standard.c
! src/java.base/unix/native/libnet/NetworkInterface.c

Changeset: 74eed688
Author:    Martin Doerr <mdoerr at openjdk.org>
Date:      2021-09-14 08:49:33 +0000
URL:       https://git.openjdk.java.net/jdk11u/commit/74eed68892cf5c0fcde5d88eb0e1070e239b7af3

8228442: DHKeyExchange/LegacyDHEKeyExchange.java failed due to "SSLException: An established connection was aborted by the software in your host machine"

Backport-of: 7e3bc4cb444c7b7f3cd3e514b4ad7d7137799401

! test/jdk/sun/security/ssl/DHKeyExchange/LegacyDHEKeyExchange.java

Changeset: 124f3aca
Author:    Martin Doerr <mdoerr at openjdk.org>
Date:      2021-09-14 12:36:16 +0000
URL:       https://git.openjdk.java.net/jdk11u/commit/124f3aca23ddf7c4f5a5959b1519dcf5b610be3b

8211227: Inconsistent TLS protocol version in debug output

Reviewed-by: sgehwolf
Backport-of: a86728850e9919d2bbeeef70093adbd87bc3bb26

! src/java.base/share/classes/sun/security/ssl/DTLSOutputRecord.java
! src/java.base/share/classes/sun/security/ssl/HandshakeContext.java
! src/java.base/share/classes/sun/security/ssl/SSLEngineOutputRecord.java
! src/java.base/share/classes/sun/security/ssl/SSLSocketOutputRecord.java
! test/jdk/sun/security/ssl/EngineArgs/DebugReportsOneExtraByte.java
+ test/jdk/sun/security/ssl/SSLLogger/LoggingFormatConsistency.java

Changeset: 77bbf1e0
Author:    Christoph Langer <clanger at openjdk.org>
Date:      2021-09-14 20:21:38 +0000
URL:       https://git.openjdk.java.net/jdk11u/commit/77bbf1e08cb5d6ddf788f799f61300f721c809a5

8213296: Fix legal headers in test/jdk/java/net

Backport-of: 84d6099da9437f1167ea28ea1cf4d36aa9fab937

! test/jdk/java/net/HttpURLConnection/SetAuthenticator/HTTPSetAuthenticatorTest.java
! test/jdk/java/net/HttpURLConnection/SetAuthenticator/HTTPTest.java
! test/jdk/java/net/HttpURLConnection/SetAuthenticator/HTTPTestClient.java
! test/jdk/java/net/HttpURLConnection/SetAuthenticator/HTTPTestServer.java
! test/jdk/java/net/Inet6Address/serialize/Inet6AddressSerTest.java
! test/jdk/java/net/MulticastSocket/NetworkInterfaceEmptyGetInetAddressesTest.java
! test/jdk/java/net/URLConnection/ContentHandlers/plain.template
! test/jdk/java/net/httpclient/DigestEchoServer.java
! test/jdk/java/net/httpclient/ProxyAuthTest.java
! test/jdk/java/net/httpclient/http2/server/Queue.java

Changeset: 97d37b8e
Author:    Christoph Langer <clanger at openjdk.org>
Date:      2021-09-14 20:36:13 +0000
URL:       https://git.openjdk.java.net/jdk11u/commit/97d37b8e9c320980ff8c487656221e9070e1d0c0

8213305: Fix legal headers in test/java/math

Reviewed-by: stuefe
Backport-of: e21d8fef64ccc9db2c5693d5e011a8e7ddf3806b

! test/jdk/java/math/BigInteger/PrimeTest.java

Changeset: 1d09112e
Author:    Christoph Langer <clanger at openjdk.org>
Date:      2021-09-14 20:38:51 +0000
URL:       https://git.openjdk.java.net/jdk11u/commit/1d09112ec36a7162140b3099d7af19cd3c8424f0

8213306: Fix legal headers in test/java/nio

Reviewed-by: stuefe
Backport-of: 36ca4f5893a7f646205a558124fee2dd50a5abd5

! test/jdk/java/nio/channels/SelectionKey/AtomicUpdates.java

Changeset: dc43ace9
Author:    Christoph Langer <clanger at openjdk.org>
Date:      2021-09-14 20:40:48 +0000
URL:       https://git.openjdk.java.net/jdk11u/commit/dc43ace97bac16ced2653cbc6d81e100ceebcb8d

8213328: Update test copyrights in test/java/util/zip and test/jdk/tools

Reviewed-by: mdoerr
Backport-of: 87f243d5390b32e16ebf8445fc99b536f864893d

! src/java.base/share/classes/sun/security/util/math/intpoly/header.txt
! test/jdk/java/util/zip/zip.java
! test/jdk/tools/jmod/src/apa/jdk/test/apa/Apa.java
! test/jdk/tools/jmod/src/apa/module-info.java
! test/jdk/tools/jmod/src/foo/jdk/test/foo/Foo.java
! test/jdk/tools/jmod/src/foo/jdk/test/foo/internal/Message.java
! test/jdk/tools/jmod/src/foo/module-info.java
! test/jdk/tools/pack200/pack200-verifier/src/xmlkit/ClassReader.java
! test/jdk/tools/pack200/pack200-verifier/src/xmlkit/CommandLineParser.java
! test/jdk/tools/pack200/pack200-verifier/src/xmlkit/TokenList.java
! test/jdk/tools/pack200/pack200-verifier/src/xmlkit/XMLKit.java

Changeset: 59f0ea38
Author:    Christoph Langer <clanger at openjdk.org>
Date:      2021-09-14 20:56:11 +0000
URL:       https://git.openjdk.java.net/jdk11u/commit/59f0ea3882f051001f5f30e899bbbd4f457058f5

8213301: Fix legal headers in jdk logging tests

Backport-of: 059682d68136d3d82cede2db774989fabefafa24

! test/jdk/java/lang/System/LoggerFinder/internal/SystemLoggerInPlatformLoader/SystemLoggerInPlatformLoader.java
! test/jdk/java/lang/System/LoggerFinder/internal/SystemLoggerInPlatformLoader/systempkg/log/SystemLoggerAccessor.java
! test/jdk/java/lang/System/LoggerFinder/modules/Base.java
! test/jdk/java/lang/System/LoggerFinder/modules/JDKLoggerForImageTest.java
! test/jdk/java/lang/System/LoggerFinder/modules/JDKLoggerForJDKTest.java
! test/jdk/java/lang/System/LoggerFinder/modules/LoggerInImageTest.java
! test/jdk/java/lang/System/LoggerFinder/modules/NamedLoggerForImageTest.java
! test/jdk/java/lang/System/LoggerFinder/modules/NamedLoggerForJDKTest.java
! test/jdk/java/lang/System/LoggerFinder/modules/UnnamedLoggerForImageTest.java
! test/jdk/java/lang/System/LoggerFinder/modules/UnnamedLoggerForJDKTest.java
! test/jdk/java/lang/System/LoggerFinder/modules/boot_client/BootClient.java
! test/jdk/java/lang/System/LoggerFinder/modules/boot_usage/BootUsage.java
! test/jdk/java/lang/System/LoggerFinder/modules/named_client/m.t.a/module-info.java
! test/jdk/java/lang/System/LoggerFinder/modules/named_client/m.t.a/pkg/a/t/TestA.java
! test/jdk/java/lang/System/LoggerFinder/modules/named_logger/m.l.a/module-info.java
! test/jdk/java/lang/System/LoggerFinder/modules/named_logger/m.l.a/pkg/a/l/LoggerA.java
! test/jdk/java/lang/System/LoggerFinder/modules/named_logger/m.l.a/pkg/a/p/LoggerFinderA.java
! test/jdk/java/lang/System/LoggerFinder/modules/patched_client/PatchedClient.java
! test/jdk/java/lang/System/LoggerFinder/modules/patched_usage/java.base/java/lang/PatchedUsage.java
! test/jdk/java/lang/System/LoggerFinder/modules/unnamed_client/pkg/b/t/TestB.java
! test/jdk/java/lang/System/LoggerFinder/modules/unnamed_logger/pkg/b/l/LoggerB.java
! test/jdk/java/lang/System/LoggerFinder/modules/unnamed_logger/pkg/b/p/LoggerFinderB.java
! test/jdk/java/util/logging/LogManager/LinkageErrorTest.java

Changeset: 977ca313
Author:    Vladimir Kempik <vkempik at openjdk.org>
Date:      2021-09-14 22:15:39 +0000
URL:       https://git.openjdk.java.net/jdk11u/commit/977ca313bfba0b51c3c06a5294e83b4ef9a45374

8273671: Backport of 8260616 misses one JNF header inclusion removal

Reviewed-by: phh

! src/java.desktop/macosx/native/libawt_lwawt/awt/GeomUtilities.m

Changeset: 625690e4
Author:    Martin Doerr <mdoerr at openjdk.org>
Date:      2021-09-15 08:19:24 +0000
URL:       https://git.openjdk.java.net/jdk11u/commit/625690e44ff390924c4b9d5a028d24fb807b5eb9

8263303: C2 compilation fails with assert(found_sfpt) failed: no node in loop that's not input to safepoint

Reviewed-by: roland
Backport-of: d4377afb999f4f03d384ded97771c83ea1c1f513

! src/hotspot/share/opto/loopnode.cpp
! src/hotspot/share/opto/loopopts.cpp
+ test/hotspot/jtreg/compiler/loopstripmining/TestPinnedUseInOuterLSMUnusedBySfpt.java

Changeset: 87299f32
Author:    Martin Doerr <mdoerr at openjdk.org>
Date:      2021-09-15 08:22:56 +0000
URL:       https://git.openjdk.java.net/jdk11u/commit/87299f3239bd1c8cf69b4e7217a53ababc4ffe33

8268019: C2: assert(no_dead_loop) failed: dead loop detected

Reviewed-by: phh
Backport-of: 489e5fd12a37a45f4f5ea64b05f85c6f99f70811

! src/hotspot/share/opto/ifnode.cpp
+ test/hotspot/jtreg/compiler/c2/TestDeadLoopSplitIfLoop.java

Changeset: 3319efb2
Author:    Martin Doerr <mdoerr at openjdk.org>
Date:      2021-09-15 08:34:18 +0000
URL:       https://git.openjdk.java.net/jdk11u/commit/3319efb2b774b465cdbde62bce2d9ffce2ac0ce3

8268672: C2: assert(!loop->is_member(u_loop)) failed: can be in outer loop or out of both loops only

Backport-of: d3ad8cd344681fe8442f821f97f05996bb972abe

! src/hotspot/share/opto/loopopts.cpp
+ test/hotspot/jtreg/compiler/loopstripmining/TestPinnedNodeInInnerLoop.java

Changeset: 9437d45b
Author:    Martin Doerr <mdoerr at openjdk.org>
Date:      2021-09-15 09:10:47 +0000
URL:       https://git.openjdk.java.net/jdk11u/commit/9437d45b4b82e9b60317acb248a215f1aa4f972e

8252049: Native memory leak in ciMethodData ctor

Reviewed-by: phh
Backport-of: 044616bd71ab82f0f67670152cecbabfee83d00c

! src/hotspot/share/ci/ciMethodData.cpp
! src/hotspot/share/ci/ciMethodData.hpp
! src/hotspot/share/jvmci/vmStructs_jvmci.cpp
! src/hotspot/share/oops/methodData.cpp
! src/hotspot/share/oops/methodData.hpp
! src/hotspot/share/runtime/vmStructs.cpp
! src/jdk.internal.vm.ci/share/classes/jdk.vm.ci.hotspot/src/jdk/vm/ci/hotspot/HotSpotVMConfig.java

Changeset: 579fbcba
Author:    Lutz Schmidt <lucy at openjdk.org>
Committer: Martin Doerr <mdoerr at openjdk.org>
Date:      2021-09-15 12:39:23 +0000
URL:       https://git.openjdk.java.net/jdk11u/commit/579fbcba4334d69ee3d20eb07b6974d3fd406d71

8271490: [ppc] [s390]: Crash in JavaThread::pd_get_top_frame_for_profiling

Reviewed-by: mdoerr
Backport-of: 276b07b36af01d339e48baada7a512451fe34afe

! src/hotspot/cpu/ppc/frame_ppc.cpp
! src/hotspot/cpu/s390/frame_s390.cpp
! src/hotspot/os_cpu/linux_ppc/thread_linux_ppc.cpp
! src/hotspot/os_cpu/linux_s390/thread_linux_s390.cpp

Changeset: e9aaba42
Author:    Zhengyu Gu <zgu at openjdk.org>
Date:      2021-09-15 14:13:55 +0000
URL:       https://git.openjdk.java.net/jdk11u/commit/e9aaba422a519e2c68060a01f31cdf38d5ed9ace

8169959: javax/swing/JTable/6263446/bug6263446.java: Table should be editing

Reviewed-by: shade
Backport-of: 8812113984177bb14d2a7b51b9391097853585b8

! test/jdk/ProblemList.txt
! test/jdk/javax/swing/JTable/6263446/bug6263446.java

Changeset: 263d070e
Author:    Thomas Stuefe <stuefe at openjdk.org>
Date:      2021-09-16 06:58:19 +0000
URL:       https://git.openjdk.java.net/jdk11u/commit/263d070e28ae4da0b28afa5fe5b7761488cfb548

8260571: Add PrintMetaspaceStatistics to print metaspace statistics upon VM exit

Reviewed-by: clanger
Backport-of: ddd2951ba91fe3860b92d2f9bad4e0d900f1d650

! src/hotspot/share/runtime/globals.hpp
! src/hotspot/share/runtime/java.cpp

Changeset: 22126832
Author:    Christoph Langer <clanger at openjdk.org>
Date:      2021-09-16 09:32:23 +0000
URL:       https://git.openjdk.java.net/jdk11u/commit/221268325617f9a63efd730f80ef285cb66e0f3f

8213330: Fix legal headers in i18n tests

Reviewed-by: phh
Backport-of: a1029a472983b457707f8807b160b7eaf4a123f9

! test/jdk/java/util/Formatter/spi/NoGroupingUsed.java
! test/jdk/java/util/Locale/Bug8179071.java
! test/jdk/java/util/Locale/LocaleCmdOverrides.java
! test/jdk/java/util/Locale/SoftKeys.java
! test/jdk/java/util/spi/ResourceBundleControlProvider/com/foo/XmlRB.xml
! test/jdk/java/util/spi/ResourceBundleControlProvider/com/foo/XmlRB_ja.xml
! test/jdk/sun/util/calendar/zi/BackEnd.java
! test/jdk/sun/util/calendar/zi/Checksum.java
! test/jdk/sun/util/calendar/zi/DayOfWeek.java
! test/jdk/sun/util/calendar/zi/Gen.java
! test/jdk/sun/util/calendar/zi/GenDoc.java
! test/jdk/sun/util/calendar/zi/Main.java
! test/jdk/sun/util/calendar/zi/Mappings.java
! test/jdk/sun/util/calendar/zi/Month.java
! test/jdk/sun/util/calendar/zi/Rule.java
! test/jdk/sun/util/calendar/zi/RuleDay.java
! test/jdk/sun/util/calendar/zi/RuleRec.java
! test/jdk/sun/util/calendar/zi/Simple.java
! test/jdk/sun/util/calendar/zi/Time.java
! test/jdk/sun/util/calendar/zi/Timezone.java
! test/jdk/sun/util/calendar/zi/TzIDOldMapping.java
! test/jdk/sun/util/calendar/zi/Zone.java
! test/jdk/sun/util/calendar/zi/ZoneInfoFile.java
! test/jdk/sun/util/calendar/zi/ZoneInfoOld.java
! test/jdk/sun/util/calendar/zi/ZoneRec.java
! test/jdk/sun/util/calendar/zi/Zoneinfo.java
! test/jdk/sun/util/calendar/zi/tzdata_jdk/jdk11_backward
! test/jdk/sun/util/locale/provider/Bug8152817.java
! test/jdk/sun/util/resources/cldr/Bug8204603.java

Changeset: d79b68e3
Author:    Christoph Langer <clanger at openjdk.org>
Date:      2021-09-16 10:10:45 +0000
URL:       https://git.openjdk.java.net/jdk11u/commit/d79b68e347ee70f0f541d8beb8e51a039fa92195

8218483: Crash in "assert(_daemon_threads_count->get_value() > daemon_count) failed: thread count mismatch 5 : 5"

Reviewed-by: stuefe
Backport-of: 2f20909d10ae33d93d62f5dcd4915efdbd83d968

! src/hotspot/share/prims/jni.cpp
! src/hotspot/share/runtime/thread.cpp
! src/hotspot/share/runtime/thread.hpp
! test/hotspot/gtest/utilities/utilitiesHelper.inline.hpp

Changeset: 376d422c
Author:    Martin Doerr <mdoerr at openjdk.org>
Date:      2021-09-16 12:36:51 +0000
URL:       https://git.openjdk.java.net/jdk11u/commit/376d422cd1a2c2efbbf2d0f86d4fdadf656592fc

8273358: macOS Monterey does not have the font Times needed by Serif

Reviewed-by: stuefe
Backport-of: efe3ed1e705a6f3785761e64f7187de809daa731

! src/java.desktop/macosx/classes/sun/font/CFontManager.java
+ test/jdk/java/awt/FontClass/LogicalFontsTest.java

Changeset: 0da130ed
Author:    Martin Doerr <mdoerr at openjdk.org>
Date:      2021-09-16 12:37:56 +0000
URL:       https://git.openjdk.java.net/jdk11u/commit/0da130ed41343df5d5be3c36c31dd475091ed91c

8269951: [macos] Focus not painted in JButton when  setBorderPainted(false) is invoked

Reviewed-by: stuefe
Backport-of: 481c1f0549e361e8e83fcf0530acc4ebdb60104b

! src/java.desktop/macosx/classes/com/apple/laf/AquaButtonUI.java
+ test/jdk/javax/swing/plaf/aqua/AquaButtonFocusTest.java

Changeset: 25cad2fe
Author:    Martin Doerr <mdoerr at openjdk.org>
Date:      2021-09-16 12:38:59 +0000
URL:       https://git.openjdk.java.net/jdk11u/commit/25cad2fea592b47998de0f0bccc4f2d07e57ce64

8272806: [macOS] "Apple AWT Internal Exception" when input method is changed

Reviewed-by: stuefe
Backport-of: f681d6544ac2506cb72e45c1f9ed8dfbbde099f2

! src/java.desktop/macosx/native/libawt_lwawt/awt/CInputMethod.m
! src/java.desktop/macosx/native/libawt_lwawt/awt/LWCToolkit.m

Changeset: 295f8823
Author:    Martin Doerr <mdoerr at openjdk.org>
Date:      2021-09-16 12:40:01 +0000
URL:       https://git.openjdk.java.net/jdk11u/commit/295f8823a5deab5e7785f6a899028d977694eb23

8261036: Reduce classes loaded by CleanerFactory initialization

Backport-of: 992b50087d2ec8878dfcbbd1820a00b6b6bdf644

! src/java.base/share/classes/jdk/internal/misc/InnocuousThread.java
! src/java.base/share/classes/jdk/internal/ref/CleanerFactory.java
! src/java.base/share/classes/jdk/internal/ref/CleanerImpl.java

Changeset: 89a1f2a4
Author:    Martin Doerr <mdoerr at openjdk.org>
Date:      2021-09-16 12:47:44 +0000
URL:       https://git.openjdk.java.net/jdk11u/commit/89a1f2a4654be32477f096e23184a4c0b8833fff

8273541: Cleaner Thread creates with normal priority instead of MAX_PRIORITY - 2

Backport-of: 4e6de5f9defc031158e027bcbbaf6232b8c03d60

! src/java.base/share/classes/jdk/internal/ref/CleanerImpl.java

Changeset: e3f923f9
Author:    Aleksey Shipilev <shade at openjdk.org>
Date:      2021-09-16 15:24:13 +0000
URL:       https://git.openjdk.java.net/jdk11u/commit/e3f923f9dd24e3882b52bcc03ea47390a828c90b

8273795: Zero SPARC64 debug builds fail due to missing interpreter fields

Reviewed-by: coleenp

! src/hotspot/share/interpreter/bytecodeInterpreter.cpp

Changeset: 777039b1
Author:    Jonathan Dowland <jdowland at openjdk.org>
Committer: Christoph Langer <clanger at openjdk.org>
Date:      2021-09-16 15:25:31 +0000
URL:       https://git.openjdk.java.net/jdk11u/commit/777039b1e6a243d005d49d29e1d6d92aa6941daf

8246114: java/net/MulticastSocket/Promiscuous.java fails after 8241072 (multi-homed systems)

Fixed the test - an IPv4 group cannot be joined from an interface that has no IPv4 address configured

Backport-of: 0f43de9f026d5405dd7a38799e499312ef8df890

! test/jdk/java/net/MulticastSocket/Promiscuous.java

Changeset: 54a9e3c0
Author:    Aleksey Shipilev <shade at openjdk.org>
Date:      2021-09-17 07:29:04 +0000
URL:       https://git.openjdk.java.net/jdk11u/commit/54a9e3c057288786d03f7768ab975680e502cd07

8236177: assert(status == 0) failed: error ETIMEDOUT(60), cond_wait

Extend the assert to cover the new case.

Reviewed-by: clanger
Backport-of: 91ed3fc599583270d180c44efc3f1793dfa69325

! src/hotspot/os/posix/os_posix.cpp
! src/hotspot/share/utilities/macros.hpp

Changeset: 3bddee5a
Author:    Martin Doerr <mdoerr at openjdk.org>
Date:      2021-09-17 08:32:27 +0000
URL:       https://git.openjdk.java.net/jdk11u/commit/3bddee5a4cb5c636bd24e9315201df479d86c24f

8210392: assert(Compile::current()->live_nodes() < Compile::current()->max_node_limit()) failed: Live Node limit exceeded limit

Avoid excessive split-if.

Backport-of: a17df8d45b53bf8864210e793229d2df5e5a36c9

! src/hotspot/share/opto/loopnode.hpp
! src/hotspot/share/opto/loopopts.cpp
+ test/hotspot/jtreg/compiler/loopopts/Test8210392.java

Changeset: e34f0476
Author:    Martin Doerr <mdoerr at openjdk.org>
Date:      2021-09-17 08:36:01 +0000
URL:       https://git.openjdk.java.net/jdk11u/commit/e34f04762f5c87d038a19859abdd2ce4a57070f6

8240256: Better resource cleaning for SunPKCS11 Provider

Reviewed-by: goetz
Backport-of: bdeaeb47d0155b9f233274cff90334e8dd761aae

! src/jdk.crypto.cryptoki/share/classes/sun/security/pkcs11/Config.java
! src/jdk.crypto.cryptoki/share/classes/sun/security/pkcs11/KeyCache.java
! src/jdk.crypto.cryptoki/share/classes/sun/security/pkcs11/P11Key.java
! src/jdk.crypto.cryptoki/share/classes/sun/security/pkcs11/Session.java
! src/jdk.crypto.cryptoki/share/classes/sun/security/pkcs11/SessionManager.java
! src/jdk.crypto.cryptoki/share/classes/sun/security/pkcs11/SunPKCS11.java
! src/jdk.crypto.cryptoki/share/classes/sun/security/pkcs11/Token.java
! test/jdk/sun/security/pkcs11/PKCS11Test.java
+ test/jdk/sun/security/pkcs11/Provider/MultipleLogins-nss.txt
+ test/jdk/sun/security/pkcs11/Provider/MultipleLogins.java
+ test/jdk/sun/security/pkcs11/Provider/MultipleLogins.sh
+ test/lib/jdk/test/lib/util/ForceGC.java

Changeset: 74c221b6
Author:    Martin Doerr <mdoerr at openjdk.org>
Date:      2021-09-17 09:13:39 +0000
URL:       https://git.openjdk.java.net/jdk11u/commit/74c221b65f806348e1bf603e729914a5d03d08e9

8269034: AccessControlException for SunPKCS11 daemon threads

Reviewed-by: clanger
Backport-of: 0d745ae8fde5cab290dc8c695d2906f9a98c491c

! src/java.base/share/classes/module-info.java
! src/java.base/share/lib/security/default.policy
! src/jdk.crypto.cryptoki/share/classes/sun/security/pkcs11/SunPKCS11.java
! test/jdk/sun/security/pkcs11/Provider/MultipleLogins.java
! test/jdk/sun/security/pkcs11/Provider/MultipleLogins.sh

Changeset: d754399d
Author:    Goetz Lindenmaier <goetz at openjdk.org>
Date:      2021-09-17 13:34:41 +0000
URL:       https://git.openjdk.java.net/jdk11u/commit/d754399d90d6661cc22ff837d51eb7c1d2a8f220

8213110: Remove the use of applets in automatic tests

Reviewed-by: clanger
Backport-of: b5998aadf065404608e077b1064e56e99a537095

! test/jdk/ProblemList.txt
- test/jdk/java/awt/Choice/PopdownGeneratesMouseEvents/PopdownGeneratesMouseEvents.html
! test/jdk/java/awt/Choice/PopdownGeneratesMouseEvents/PopdownGeneratesMouseEvents.java
- test/jdk/java/awt/Choice/PopupPosTest/PopupPosTest.html
! test/jdk/java/awt/Choice/PopupPosTest/PopupPosTest.java
- test/jdk/java/awt/Clipboard/HTMLTransferTest/HTMLTransferTest.html
! test/jdk/java/awt/Clipboard/HTMLTransferTest/HTMLTransferTest.java
- test/jdk/java/awt/Component/F10TopToplevel/F10TopToplevel.html
! test/jdk/java/awt/Component/F10TopToplevel/F10TopToplevel.java
! test/jdk/java/awt/ComponentOrientation/BorderTest.java
! test/jdk/java/awt/ComponentOrientation/FlowTest.java
- test/jdk/java/awt/EventDispatchThread/LoopRobustness/LoopRobustness.html
! test/jdk/java/awt/EventDispatchThread/LoopRobustness/LoopRobustness.java
- test/jdk/java/awt/FileDialog/FilenameFilterTest/FilenameFilterTest.html
! test/jdk/java/awt/FileDialog/FilenameFilterTest/FilenameFilterTest.java
! test/jdk/java/awt/Focus/ActualFocusedWindowTest/ActualFocusedWindowBlockingTest.java
! test/jdk/java/awt/Focus/ActualFocusedWindowTest/ActualFocusedWindowRetaining.java
- test/jdk/java/awt/Focus/AppletInitialFocusTest/AppletInitialFocusTest.html
! test/jdk/java/awt/Focus/AppletInitialFocusTest/AppletInitialFocusTest.java
- test/jdk/java/awt/Focus/AppletInitialFocusTest/AppletInitialFocusTest1.html
! test/jdk/java/awt/Focus/AppletInitialFocusTest/AppletInitialFocusTest1.java
! test/jdk/java/awt/Focus/AutoRequestFocusTest/AutoRequestFocusSetVisibleTest.java
! test/jdk/java/awt/Focus/AutoRequestFocusTest/AutoRequestFocusToFrontTest.java
- test/jdk/java/awt/Focus/ChildWindowFocusTest/ChildWindowFocusTest.html
! test/jdk/java/awt/Focus/ChildWindowFocusTest/ChildWindowFocusTest.java
! test/jdk/java/awt/Focus/ClearLwQueueBreakTest/ClearLwQueueBreakTest.java
! test/jdk/java/awt/Focus/CloseDialogActivateOwnerTest/CloseDialogActivateOwnerTest.java
! test/jdk/java/awt/Focus/ConsumeNextKeyTypedOnModalShowTest/ConsumeNextKeyTypedOnModalShowTest.java
! test/jdk/java/awt/Focus/ContainerFocusAutoTransferTest/ContainerFocusAutoTransferTest.java
- test/jdk/java/awt/Focus/DeiconifiedFrameLoosesFocus/DeiconifiedFrameLoosesFocus.html
! test/jdk/java/awt/Focus/DeiconifiedFrameLoosesFocus/DeiconifiedFrameLoosesFocus.java
! test/jdk/java/awt/Focus/FocusEmbeddedFrameTest/FocusEmbeddedFrameTest.java
! test/jdk/java/awt/Focus/FocusOwnerFrameOnClick/FocusOwnerFrameOnClick.java
- test/jdk/java/awt/Focus/FocusSubRequestTest/FocusSubRequestTest.html
! test/jdk/java/awt/Focus/FocusSubRequestTest/FocusSubRequestTest.java
! test/jdk/java/awt/Focus/FrameJumpingToMouse/FrameJumpingToMouse.java
! test/jdk/java/awt/Focus/IconifiedFrameFocusChangeTest/IconifiedFrameFocusChangeTest.java
- test/jdk/java/awt/Focus/ModalBlockedStealsFocusTest/ModalBlockedStealsFocusTest.html
! test/jdk/java/awt/Focus/ModalBlockedStealsFocusTest/ModalBlockedStealsFocusTest.java
- test/jdk/java/awt/Focus/ModalDialogInitialFocusTest/ModalDialogInitialFocusTest.html
! test/jdk/java/awt/Focus/ModalDialogInitialFocusTest/ModalDialogInitialFocusTest.java
- test/jdk/java/awt/Focus/ModalExcludedWindowClickTest/ModalExcludedWindowClickTest.html
! test/jdk/java/awt/Focus/ModalExcludedWindowClickTest/ModalExcludedWindowClickTest.java
! test/jdk/java/awt/Focus/NoAutotransferToDisabledCompTest/NoAutotransferToDisabledCompTest.java
- test/jdk/java/awt/Focus/NonFocusableBlockedOwnerTest/NonFocusableBlockedOwnerTest.html
! test/jdk/java/awt/Focus/NonFocusableBlockedOwnerTest/NonFocusableBlockedOwnerTest.java
! test/jdk/java/awt/Focus/NonFocusableWindowTest/NonfocusableOwnerTest.java
! test/jdk/java/awt/Focus/RequestFocusToDisabledCompTest/RequestFocusToDisabledCompTest.java
! test/jdk/java/awt/Focus/ResetMostRecentFocusOwnerTest/ResetMostRecentFocusOwnerTest.java
! test/jdk/java/awt/Focus/RestoreFocusOnDisabledComponentTest/RestoreFocusOnDisabledComponentTest.java
! test/jdk/java/awt/Focus/ShowFrameCheckForegroundTest/ShowFrameCheckForegroundTest.java
- test/jdk/java/awt/Focus/ToFrontFocusTest/ToFrontFocus.html
! test/jdk/java/awt/Focus/ToFrontFocusTest/ToFrontFocus.java
- test/jdk/java/awt/Focus/WindowInitialFocusTest/WindowInitialFocusTest.html
! test/jdk/java/awt/Focus/WindowInitialFocusTest/WindowInitialFocusTest.java
- test/jdk/java/awt/Focus/WindowUpdateFocusabilityTest/WindowUpdateFocusabilityTest.html
! test/jdk/java/awt/Focus/WindowUpdateFocusabilityTest/WindowUpdateFocusabilityTest.java
! test/jdk/java/awt/Focus/WrongKeyTypedConsumedTest/WrongKeyTypedConsumedTest.java
! test/jdk/java/awt/FontClass/CreateFont/BigFont.java
- test/jdk/java/awt/FontClass/CreateFont/bigfont.html
- test/jdk/java/awt/Frame/DisposeStressTest/DisposeStressTest.html
! test/jdk/java/awt/Frame/DisposeStressTest/DisposeStressTest.java
- test/jdk/java/awt/Frame/NonEDT_GUI_DeadlockTest/NonEDT_GUI_Deadlock.html
! test/jdk/java/awt/Frame/NonEDT_GUI_DeadlockTest/NonEDT_GUI_Deadlock.java
! test/jdk/java/awt/FullScreen/SetFSWindow/FSFrame.java
- test/jdk/java/awt/GridBagLayout/GridBagLayoutIpadXYTest/GridBagLayoutIpadXYTest.html
! test/jdk/java/awt/GridBagLayout/GridBagLayoutIpadXYTest/GridBagLayoutIpadXYTest.java
- test/jdk/java/awt/KeyboardFocusmanager/ConsumeNextMnemonicKeyTypedTest/ConsumeForModalDialogTest/ConsumeForModalDialogTest.html
! test/jdk/java/awt/KeyboardFocusmanager/ConsumeNextMnemonicKeyTypedTest/ConsumeForModalDialogTest/ConsumeForModalDialogTest.java
- test/jdk/java/awt/KeyboardFocusmanager/ConsumeNextMnemonicKeyTypedTest/ConsumeNextMnemonicKeyTypedTest.html
! test/jdk/java/awt/KeyboardFocusmanager/ConsumeNextMnemonicKeyTypedTest/ConsumeNextMnemonicKeyTypedTest.java
- test/jdk/java/awt/KeyboardFocusmanager/TypeAhead/ButtonActionKeyTest/ButtonActionKeyTest.html
! test/jdk/java/awt/KeyboardFocusmanager/TypeAhead/ButtonActionKeyTest/ButtonActionKeyTest.java
- test/jdk/java/awt/KeyboardFocusmanager/TypeAhead/MenuItemActivatedTest/MenuItemActivatedTest.html
! test/jdk/java/awt/KeyboardFocusmanager/TypeAhead/MenuItemActivatedTest/MenuItemActivatedTest.java
- test/jdk/java/awt/KeyboardFocusmanager/TypeAhead/TestDialogTypeAhead.html
! test/jdk/java/awt/KeyboardFocusmanager/TypeAhead/TestDialogTypeAhead.java
- test/jdk/java/awt/List/FirstItemRemoveTest/FirstItemRemoveTest.html
! test/jdk/java/awt/List/FirstItemRemoveTest/FirstItemRemoveTest.java
- test/jdk/java/awt/List/FocusEmptyListTest/FocusEmptyListTest.html
! test/jdk/java/awt/List/FocusEmptyListTest/FocusEmptyListTest.java
- test/jdk/java/awt/List/KeyEventsTest/KeyEventsTest.html
! test/jdk/java/awt/List/KeyEventsTest/KeyEventsTest.java
- test/jdk/java/awt/Mouse/ExtraMouseClick/ExtraMouseClick.html
! test/jdk/java/awt/Mouse/ExtraMouseClick/ExtraMouseClick.java
- test/jdk/java/awt/Mouse/TitleBarDoubleClick/TitleBarDoubleClick.html
! test/jdk/java/awt/Mouse/TitleBarDoubleClick/TitleBarDoubleClick.java
- test/jdk/java/awt/Multiscreen/WindowGCChangeTest/WindowGCChangeTest.html
! test/jdk/java/awt/Multiscreen/WindowGCChangeTest/WindowGCChangeTest.java
- test/jdk/java/awt/Window/HandleWindowDestroyTest/HandleWindowDestroyTest.html
! test/jdk/java/awt/Window/HandleWindowDestroyTest/HandleWindowDestroyTest.java
- test/jdk/java/awt/datatransfer/DragUnicodeBetweenJVMTest/DragUnicodeBetweenJVMTest.html
! test/jdk/java/awt/datatransfer/DragUnicodeBetweenJVMTest/DragUnicodeBetweenJVMTest.java
- test/jdk/java/awt/datatransfer/MissedHtmlAndRtfBug/MissedHtmlAndRtfBug.html
! test/jdk/java/awt/datatransfer/MissedHtmlAndRtfBug/MissedHtmlAndRtfBug.java
- test/jdk/java/awt/dnd/DragInterceptorAppletTest/DragInterceptorAppletTest.html
! test/jdk/java/awt/dnd/DragInterceptorAppletTest/DragInterceptorAppletTest.java
- test/jdk/java/awt/dnd/FileListBetweenJVMsTest/FileListBetweenJVMsTest.html
! test/jdk/java/awt/dnd/FileListBetweenJVMsTest/FileListBetweenJVMsTest.java
- test/jdk/java/awt/dnd/ImageDecoratedDnDInOut/ImageDecoratedDnDInOut.html
! test/jdk/java/awt/dnd/ImageDecoratedDnDInOut/ImageDecoratedDnDInOut.java
- test/jdk/java/awt/dnd/ImageDecoratedDnDNegative/ImageDecoratedDnDNegative.html
! test/jdk/java/awt/dnd/ImageDecoratedDnDNegative/ImageDecoratedDnDNegative.java
- test/jdk/java/awt/dnd/InterJVMGetDropSuccessTest/InterJVMGetDropSuccessTest.html
! test/jdk/java/awt/dnd/InterJVMGetDropSuccessTest/InterJVMGetDropSuccessTest.java
- test/jdk/java/awt/dnd/NoFormatsCrashTest/NoFormatsCrashTest.html
! test/jdk/java/awt/dnd/NoFormatsCrashTest/NoFormatsCrashTest.java
- test/jdk/java/awt/dnd/URIListBetweenJVMsTest/URIListBetweenJVMsTest.html
! test/jdk/java/awt/dnd/URIListBetweenJVMsTest/URIListBetweenJVMsTest.java
- test/jdk/java/awt/dnd/URIListToFileListBetweenJVMsTest/URIListToFileListBetweenJVMsTest.html
! test/jdk/java/awt/dnd/URIListToFileListBetweenJVMsTest/URIListToFileListBetweenJVMsTest.java
- test/jdk/java/awt/event/ComponentEvent/MovedResizedTardyEventTest/MovedResizedTardyEventTest.html
! test/jdk/java/awt/event/ComponentEvent/MovedResizedTardyEventTest/MovedResizedTardyEventTest.java
- test/jdk/java/awt/event/KeyEvent/KeyTyped/CtrlASCII.html
! test/jdk/java/awt/event/KeyEvent/KeyTyped/CtrlASCII.java
- test/jdk/java/awt/event/MouseEvent/FrameMouseEventAbsoluteCoordsTest/FrameMouseEventAbsoluteCoordsTest.html
! test/jdk/java/awt/event/MouseEvent/FrameMouseEventAbsoluteCoordsTest/FrameMouseEventAbsoluteCoordsTest.java
- test/jdk/java/awt/event/MouseEvent/MenuDragMouseEventAbsoluteCoordsTest/MenuDragMouseEventAbsoluteCoordsTest.html
! test/jdk/java/awt/event/MouseEvent/MenuDragMouseEventAbsoluteCoordsTest/MenuDragMouseEventAbsoluteCoordsTest.java
- test/jdk/java/awt/event/MouseEvent/MouseClickTest/MouseClickTest.html
! test/jdk/java/awt/event/MouseEvent/MouseClickTest/MouseClickTest.java
- test/jdk/java/awt/event/MouseEvent/MouseWheelEventAbsoluteCoordsTest/MouseWheelEventAbsoluteCoordsTest.html
! test/jdk/java/awt/event/MouseEvent/MouseWheelEventAbsoluteCoordsTest/MouseWheelEventAbsoluteCoordsTest.java
- test/jdk/java/awt/event/MouseEvent/RobotLWTest/RobotLWTest.html
! test/jdk/java/awt/event/MouseEvent/RobotLWTest/RobotLWTest.java
- test/jdk/java/awt/event/MouseWheelEvent/InfiniteRecursion/InfiniteRecursion_2.html
! test/jdk/java/awt/event/MouseWheelEvent/InfiniteRecursion/InfiniteRecursion_2.java
- test/jdk/java/awt/event/MouseWheelEvent/InfiniteRecursion/InfiniteRecursion_3.html
! test/jdk/java/awt/event/MouseWheelEvent/InfiniteRecursion/InfiniteRecursion_3.java
- test/jdk/javax/imageio/AppletResourceTest.html
! test/jdk/javax/imageio/AppletResourceTest.java
- test/jdk/javax/swing/JFrame/4962534/bug4962534.html
! test/jdk/javax/swing/JFrame/4962534/bug4962534.java
- test/jdk/javax/swing/JPopupMenu/4634626/bug4634626.html
! test/jdk/javax/swing/JPopupMenu/4634626/bug4634626.java
- test/jdk/javax/swing/MultiUIDefaults/4300666/bug4300666.html
! test/jdk/javax/swing/MultiUIDefaults/4300666/bug4300666.java
- test/jdk/javax/swing/text/StyledEditorKit/4506788/bug4506788.html
! test/jdk/javax/swing/text/StyledEditorKit/4506788/bug4506788.java
- test/jdk/sun/java2d/cmm/ColorConvertOp/ConstructorsNullTest/ConstructorsNullTest.html
! test/jdk/sun/java2d/cmm/ColorConvertOp/ConstructorsNullTest/ConstructorsNullTest.java

Changeset: 48e5f412
Author:    Jonathan Dowland <jdowland at openjdk.org>
Committer: Christoph Langer <clanger at openjdk.org>
Date:      2021-09-18 21:15:47 +0000
URL:       https://git.openjdk.java.net/jdk11u/commit/48e5f412b6cd09e9d79332a033ac04c9260b1c7c

6849922: java/awt/Choice/ChoiceKeyEventReaction/ChoiceKeyEventReaction.html fails

Backport-of: 1b012e213d31b184236a56121f7f1548d1a6fe05

! test/jdk/ProblemList.txt
- test/jdk/java/awt/Choice/ChoiceKeyEventReaction/ChoiceKeyEventReaction.html
! test/jdk/java/awt/Choice/ChoiceKeyEventReaction/ChoiceKeyEventReaction.java

Changeset: 1bed6cda
Author:    Goetz Lindenmaier <goetz at openjdk.org>
Date:      2021-09-20 12:23:52 +0000
URL:       https://git.openjdk.java.net/jdk11u/commit/1bed6cda0f90e5ed6ce9997778029ca62e7dccfd

8253682: The AppletInitialFocusTest1.java is unstable

Backport-of: 1d88172c0688da48753c009355db244f249c9ebe

! test/jdk/java/awt/Focus/AppletInitialFocusTest/AppletInitialFocusTest1.java

Changeset: 9d29c77a
Author:    Martin Doerr <mdoerr at openjdk.org>
Date:      2021-09-20 13:24:31 +0000
URL:       https://git.openjdk.java.net/jdk11u/commit/9d29c77a7e9af836b0ff4a81d156491d445b96ab

8217633: Configurable extensions with system properties

Backport-of: 71bfe962ebcf46537d4624e5ddf36003365fbb84

! src/java.base/share/classes/sun/security/ssl/SSLExtension.java
+ test/jdk/sun/security/ssl/SSLSocketImpl/DisableExtensions.java

Changeset: a925af4e
Author:    Martin Doerr <mdoerr at openjdk.org>
Date:      2021-09-20 13:27:14 +0000
URL:       https://git.openjdk.java.net/jdk11u/commit/a925af4e6249cc4b434dd4eb9e44a181156a22cf

8259237: Demo selection changes with left/right arrow key. No need to press space for selection.

Backport-of: 28ff2de1860bf70b1174fd434346be750d9dbf01

! src/java.desktop/share/classes/javax/swing/plaf/basic/BasicButtonUI.java
! test/jdk/javax/swing/ButtonGroup/TestButtonGroupFocusTraversal.java

Changeset: 9f51a400
Author:    Martin Doerr <mdoerr at openjdk.org>
Date:      2021-09-20 13:29:41 +0000
URL:       https://git.openjdk.java.net/jdk11u/commit/9f51a400280d71f630e0564427118b839dabd24b

8270344: Session resumption errors

Reviewed-by: clanger
Backport-of: 04a806ec86a388b8de31d42f904c4321beb69e14

! src/java.base/share/classes/sun/security/ssl/ClientHello.java
! src/java.base/share/classes/sun/security/ssl/HandshakeContext.java
+ test/jdk/sun/security/ssl/SSLSessionImpl/InvalidateSession.java

Changeset: b65b79b9
Author:    Martin Doerr <mdoerr at openjdk.org>
Date:      2021-09-20 13:32:19 +0000
URL:       https://git.openjdk.java.net/jdk11u/commit/b65b79b918f755d6f9b1fe576d44ede5c539b140

8271560: sun/security/ssl/DHKeyExchange/LegacyDHEKeyExchange.java still fails due to "An established connection was aborted by the software in your host machine"

Backport-of: f18c0fac11aac833edfdc484e221518c55daa9a7

! test/jdk/sun/security/ssl/DHKeyExchange/LegacyDHEKeyExchange.java

Changeset: ef061756
Author:    Goetz Lindenmaier <goetz at openjdk.org>
Date:      2021-09-20 13:34:54 +0000
URL:       https://git.openjdk.java.net/jdk11u/commit/ef061756056ede5bd244954c2ba166d22d034ab4

8197560: test javax/swing/JTree/8003400/Test8003400.java fails

Reviewed-by: mdoerr
Backport-of: 56990241843a385d99756beafa9641e84e75dc63

! test/jdk/javax/swing/JTree/8003400/Test8003400.java

Changeset: 0a401757
Author:    Martin Doerr <mdoerr at openjdk.org>
Date:      2021-09-20 15:44:59 +0000
URL:       https://git.openjdk.java.net/jdk11u/commit/0a40175740f12763b5825627a68f6a2177d44a32

8216318: The usage of Disposer in the java.awt.Robot can be deleted

Reviewed-by: goetz
Backport-of: 293f77f18f96fec80d9dd5cc082d045b5dd0b813

! src/java.desktop/macosx/classes/sun/lwawt/macosx/CRobot.java
! src/java.desktop/share/classes/java/awt/Robot.java
! src/java.desktop/share/classes/java/awt/peer/RobotPeer.java
! src/java.desktop/unix/classes/sun/awt/X11/XRobotPeer.java
! src/java.desktop/windows/classes/sun/awt/windows/WRobotPeer.java
! src/java.desktop/windows/native/libawt/windows/awt_Robot.cpp
- src/java.desktop/windows/native/libawt/windows/awt_Robot.h

Changeset: 18e519c4
Author:    Martin Doerr <mdoerr at openjdk.org>
Date:      2021-09-20 15:47:38 +0000
URL:       https://git.openjdk.java.net/jdk11u/commit/18e519c4c4c566bfbd8dc22e10cf5d6096e52e03

8256066: Tests use deprecated TestNG API that is no longer available in new versions

Backport-of: 6d8acd2696f41918d4233ddffe46e6c205f9dbc3

! test/jdk/java/lang/invoke/ConstantIdentityMHTest.java
! test/jdk/java/lang/invoke/DropArgumentsTest.java
! test/jdk/java/lang/invoke/VarArgsTest.java

Changeset: 86cd9ba2
Author:    Christoph Langer <clanger at openjdk.org>
Date:      2021-09-20 17:50:38 +0000
URL:       https://git.openjdk.java.net/jdk11u/commit/86cd9ba29d329a8fa310709c443e53e94888a517

8213189: Make restricted headers in HTTP Client configurable and remove Date by default

Reviewed-by: mdoerr
Backport-of: 028f2e14b3550dd1f2a358a2a0aaf83d4a824af0

! src/java.base/share/conf/net.properties
! src/java.net.http/share/classes/jdk/internal/net/http/Exchange.java
! src/java.net.http/share/classes/jdk/internal/net/http/ExchangeImpl.java
! src/java.net.http/share/classes/jdk/internal/net/http/Http1Exchange.java
! src/java.net.http/share/classes/jdk/internal/net/http/Http1Request.java
! src/java.net.http/share/classes/jdk/internal/net/http/Stream.java
! src/java.net.http/share/classes/jdk/internal/net/http/common/Utils.java
! test/jdk/java/net/httpclient/RequestBuilderTest.java
+ test/jdk/java/net/httpclient/RestrictedHeadersTest.java
! test/jdk/java/net/httpclient/SpecialHeadersTest.java
+ test/jdk/java/net/httpclient/security/16.policy
+ test/jdk/java/net/httpclient/security/17.policy
! test/jdk/java/net/httpclient/security/Driver.java
! test/jdk/java/net/httpclient/security/Security.java

Changeset: 8a2cb871
Author:    Christoph Langer <clanger at openjdk.org>
Date:      2021-09-20 17:53:53 +0000
URL:       https://git.openjdk.java.net/jdk11u/commit/8a2cb87148aad4c4ab4f04cb1dd7b6a52df0b392

8129310: java/net/Socket/asyncClose/AsyncClose.java fails intermittently

Backport-of: fb6de4b0b65b115e1e70e7476d0627a424baad9f

! test/jdk/java/net/Socket/asyncClose/AsyncCloseTest.java
! test/jdk/java/net/Socket/asyncClose/DatagramSocket_receive.java
! test/jdk/java/net/Socket/asyncClose/ServerSocket_accept.java

Changeset: 7627023d
Author:    Christoph Langer <clanger at openjdk.org>
Date:      2021-09-20 17:55:18 +0000
URL:       https://git.openjdk.java.net/jdk11u/commit/7627023d4cd649024af651cae956c7a9a0b21bc6

8215410: Regression test for JDK-8214994

Added a regression test for 8214994 which was fixed by accident with 8211451.

Backport-of: 2e989366ea703f6eaa330f8a611ba01f27ef9997

+ test/hotspot/jtreg/compiler/loopopts/TestSplitIfOpaque1.java

Changeset: 78e18d45
Author:    Aleksey Shipilev <shade at openjdk.org>
Date:      2021-09-21 06:14:47 +0000
URL:       https://git.openjdk.java.net/jdk11u/commit/78e18d4576e591ed1e0f123647989cd130b56db1

8272318: Improve performance of HeapDumpAllTest

Backport-of: 73da66ffb707abf6dc38368a12e337d52597de25

! test/hotspot/jtreg/serviceability/dcmd/gc/HeapDumpAllTest.java

Changeset: 0d49433a
Author:    Aleksey Shipilev <shade at openjdk.org>
Date:      2021-09-21 06:15:44 +0000
URL:       https://git.openjdk.java.net/jdk11u/commit/0d49433af775fd6ee71eb0407ca69cc54d1aff04

8272850: Drop zapping values in the Zap* option descriptions

Backport-of: c5a271259d9761aaae9298e9f29ebd93d734fb0e

! src/hotspot/share/runtime/globals.hpp

Changeset: 9accd6be
Author:    Richard Reingruber <rrich at openjdk.org>
Date:      2021-09-21 06:34:10 +0000
URL:       https://git.openjdk.java.net/jdk11u/commit/9accd6be612d775401c2cc4ec15ca67784f70465

8269574: C2: Avoid redundant uncommon traps in GraphKit::builtin_throw() for JVMTI exception events

Backport-of: 72530ef666ce2ace899cf34faefe715539d1ee25

! src/hotspot/share/opto/graphKit.cpp

Changeset: 231fdea8
Author:    Goetz Lindenmaier <goetz at openjdk.org>
Date:      2021-09-21 06:58:58 +0000
URL:       https://git.openjdk.java.net/jdk11u/commit/231fdea8deaf1cac0bbfb0dc68db712345295458

8217377: javax/swing/JPopupMenu/6583251/bug6583251.java failed with UnsupportedOperation exception

Reviewed-by: clanger
Backport-of: 37a7f89c34350835a77fff38755a3707aee45bb7

! test/jdk/javax/swing/JPopupMenu/6583251/bug6583251.java

Changeset: a13296fe
Author:    Goetz Lindenmaier <goetz at openjdk.org>
Date:      2021-09-21 07:00:22 +0000
URL:       https://git.openjdk.java.net/jdk11u/commit/a13296feda1d1eb5302ef0ebbc3dcc1db7839cc0

8217903: java/net/httpclient/Response204.java fails with 404

Fixed test to use loopback address - this looks like a port reuse issue.

Backport-of: 6b64f80be4eb2c4bd0317b0a011b54ebb149252f

! test/jdk/java/net/httpclient/Response204.java

Changeset: 005b8b91
Author:    Goetz Lindenmaier <goetz at openjdk.org>
Date:      2021-09-21 07:01:09 +0000
URL:       https://git.openjdk.java.net/jdk11u/commit/005b8b9178a95a19bbd32b1d9f7303fee902d4fb

8217882: java/net/httpclient/MaxStreams.java failed once

Added some more traces to help diagnosis

Backport-of: 6dcfd0f93a05df49ae27be28ce9529ae5cbe2c7a

! test/jdk/java/net/httpclient/MaxStreams.java

Changeset: 62207ef2
Author:    Thomas Stuefe <stuefe at openjdk.org>
Date:      2021-09-21 07:21:17 +0000
URL:       https://git.openjdk.java.net/jdk11u/commit/62207ef2b9fd930edf4e22fcb82331968453a1d7

8261297: NMT: Final report should use scale 1

Backport-of: 1740de2a0d41d0689ae9bb069b93ab267a2b9495

! src/hotspot/share/services/memReporter.hpp
! src/hotspot/share/services/memTracker.cpp
! src/hotspot/share/services/memTracker.hpp

Changeset: ae849c1c
Author:    Christoph Langer <clanger at openjdk.org>
Date:      2021-09-22 08:49:21 +0000
URL:       https://git.openjdk.java.net/jdk11u/commit/ae849c1cb954799813138753da3ca91b59f1c9f7

8080569: java/lang/ProcessBuilder/DestroyTest.java fails with "RuntimeException: Process terminated prematurely"

Backport-of: 2ee8882fb97bf670dea78e4c24f09d2d2e71a37b

! test/jdk/java/lang/ProcessBuilder/DestroyTest.java

Changeset: 16ef6020
Author:    Christoph Langer <clanger at openjdk.org>
Date:      2021-09-22 08:51:26 +0000
URL:       https://git.openjdk.java.net/jdk11u/commit/16ef6020c32ec4675775a90be8bc40319b0f5f61

8217438: Adapt tools//launcher/Test7029048.java for AIX

Backport-of: 05a8750ec7090d116837eda05d3dd133697f2412

! test/jdk/tools/launcher/Test7029048.java

Changeset: 8fc3d896
Author:    Christoph Langer <clanger at openjdk.org>
Date:      2021-09-22 08:52:53 +0000
URL:       https://git.openjdk.java.net/jdk11u/commit/8fc3d896bb083da4ce0c6db7f76b4d5fced9deaa

8221259: New tests for java.net.Socket to exercise long standing behavior

Backport-of: fd14375ae262f68cb9f76b0e45d1627438e37c75

+ test/jdk/java/net/Socket/AsyncShutdown.java
+ test/jdk/java/net/Socket/ConnectionReset.java
+ test/jdk/java/net/Socket/Timeouts.java
+ test/jdk/java/net/Socket/UdpSocket.java

Changeset: 52c1288d
Author:    Goetz Lindenmaier <goetz at openjdk.org>
Date:      2021-09-22 09:25:26 +0000
URL:       https://git.openjdk.java.net/jdk11u/commit/52c1288d64d5d44c4d3bb9d9a9d32470b9a99516

Merge

Reviewed-by: clanger, sgehwolf

! src/hotspot/cpu/aarch64/macroAssembler_aarch64.cpp
! src/hotspot/cpu/aarch64/macroAssembler_aarch64.cpp

Changeset: 8c2ceccb
Author:    Goetz Lindenmaier <goetz at openjdk.org>
Date:      2021-09-22 09:36:21 +0000
URL:       https://git.openjdk.java.net/jdk11u/commit/8c2ceccbbfd759b414794a2b55d356c536533181

8165828: [TEST_BUG] The reg case:javax/swing/plaf/metal/MetalIcons/MetalHiDPIIconsTest.java failed as No Metal Look and Feel

Backport-of: 6b80f1e7cd146bbe3b70f8ef019b5fe83cc3b7f3

! test/jdk/javax/swing/plaf/metal/MetalIcons/MetalHiDPIIconsTest.java

Changeset: d78b4c78
Author:    Goetz Lindenmaier <goetz at openjdk.org>
Date:      2021-09-22 09:37:35 +0000
URL:       https://git.openjdk.java.net/jdk11u/commit/d78b4c78b12effeceeeb2cb704e6aea4ce93e911

8233403: Improve verbosity of some httpclient tests

Improve the verbosity of some httpclient tests to help diagnosis of intermittent failures. Also fixes ShortRequestBody test.

Backport-of: eaba9fe23b097338e5d567adec70873a8d4aed8f

! test/jdk/java/net/httpclient/AbstractThrowingPublishers.java
! test/jdk/java/net/httpclient/AbstractThrowingPushPromises.java
! test/jdk/java/net/httpclient/AbstractThrowingSubscribers.java
! test/jdk/java/net/httpclient/ShortRequestBody.java
! test/jdk/java/net/httpclient/ShortResponseBody.java

Changeset: 133de427
Author:    Goetz Lindenmaier <goetz at openjdk.org>
Date:      2021-09-22 12:21:22 +0000
URL:       https://git.openjdk.java.net/jdk11u/commit/133de427eabb94590f79cfaee107faa975d6b63b

8228508: [TESTBUG] java/net/httpclient/SmokeTest.java fails on Windows7

Backport-of: b4a7fb856ba622175f3c3652186874122e4dee3c

! test/jdk/com/sun/net/httpserver/EchoHandler.java
! test/jdk/java/net/httpclient/SmokeTest.java

Changeset: 0405d461
Author:    Goetz Lindenmaier <goetz at openjdk.org>
Date:      2021-09-22 12:30:05 +0000
URL:       https://git.openjdk.java.net/jdk11u/commit/0405d461580af89b9147ac7154b2d6ae2f842a58

8233634: [TESTBUG] Swing text test bug4278839.java fails on macos

Backport-of: 456fd9003e1fcfba774031e860d57e97a1bbfafd

! test/jdk/ProblemList.txt
! test/jdk/javax/swing/text/DefaultEditorKit/4278839/bug4278839.java

Changeset: 86cf496d
Author:    Martin Doerr <mdoerr at openjdk.org>
Date:      2021-09-22 16:58:27 +0000
URL:       https://git.openjdk.java.net/jdk11u/commit/86cf496d4b6b7317b688d1f4889a6611e8f5ee9a

8222446: assert(C->env()->system_dictionary_modification_counter_changed()) failed: Must invalidate if TypeFuncs differ

Remove SystemDictionary::modification_counter optimization

Reviewed-by: phh
Backport-of: 04b98fd1df8438f892e48c2425a8d75dfbd1ccc2

! src/hotspot/share/ci/ciEnv.cpp
! src/hotspot/share/ci/ciEnv.hpp
! src/hotspot/share/classfile/systemDictionary.cpp
! src/hotspot/share/classfile/systemDictionary.hpp
! src/hotspot/share/code/dependencies.cpp
! src/hotspot/share/code/dependencies.hpp
! src/hotspot/share/compiler/compileBroker.cpp
! src/hotspot/share/jvmci/jvmciEnv.cpp
! src/hotspot/share/jvmci/jvmciEnv.hpp
! src/hotspot/share/oops/method.cpp
! src/hotspot/share/opto/callGenerator.cpp
! src/hotspot/share/opto/parse1.cpp
! src/hotspot/share/prims/jvmtiRedefineClasses.cpp
! src/hotspot/share/runtime/vmStructs.cpp
! src/jdk.hotspot.agent/share/classes/sun/jvm/hotspot/ci/ciEnv.java

Changeset: b9307bdf
Author:    Goetz Lindenmaier <goetz at openjdk.org>
Date:      2021-09-23 06:16:57 +0000
URL:       https://git.openjdk.java.net/jdk11u/commit/b9307bdf45b09ad2ad0cd31fe35317de3c561a64

8214469: [macos] PIT: java/awt/Choice/ChoiceKeyEventReaction/ChoiceKeyEventReaction.java fails

Reviewed-by: mdoerr
Backport-of: c2824531a774fddd7fc57d445f9ff9401bd1d78a

! test/jdk/ProblemList.txt
! test/jdk/java/awt/Choice/ChoiceKeyEventReaction/ChoiceKeyEventReaction.java

Changeset: 43861d7a
Author:    Goetz Lindenmaier <goetz at openjdk.org>
Date:      2021-09-23 06:18:07 +0000
URL:       https://git.openjdk.java.net/jdk11u/commit/43861d7a4109345085377784dacbcd07f6573836

8215568: Refactor SA clhsdb tests to use ClhsdbLauncher

Refactoring the SA tests which test clhsdb commands to use ClhsdbLauncher for uniformity and ease of maintainence

Reviewed-by: mdoerr
Backport-of: 9c09bb98d401e7cd7394c411c9f6f59189137646

! test/hotspot/jtreg/resourcehogs/serviceability/sa/ClhsdbRegionDetailsScanOopsForG1.java
! test/hotspot/jtreg/serviceability/sa/ClhsdbCDSCore.java
! test/hotspot/jtreg/serviceability/sa/ClhsdbCDSJstackPrintAll.java
! test/hotspot/jtreg/serviceability/sa/ClhsdbFlags.java
! test/hotspot/jtreg/serviceability/sa/ClhsdbInspect.java
! test/hotspot/jtreg/serviceability/sa/ClhsdbJdis.java
! test/hotspot/jtreg/serviceability/sa/ClhsdbJstack.java
! test/hotspot/jtreg/serviceability/sa/ClhsdbLauncher.java
! test/hotspot/jtreg/serviceability/sa/ClhsdbPmap.java
! test/hotspot/jtreg/serviceability/sa/ClhsdbPrintAll.java
! test/hotspot/jtreg/serviceability/sa/ClhsdbPrintStatics.java
! test/hotspot/jtreg/serviceability/sa/ClhsdbPstack.java
! test/hotspot/jtreg/serviceability/sa/ClhsdbScanOops.java
! test/hotspot/jtreg/serviceability/sa/ClhsdbSource.java
! test/hotspot/jtreg/serviceability/sa/ClhsdbThread.java
! test/hotspot/jtreg/serviceability/sa/ClhsdbWhere.java
! test/hotspot/jtreg/serviceability/sa/TestClhsdbJstackLock.java
! test/hotspot/jtreg/serviceability/sa/TestIntConstant.java
! test/hotspot/jtreg/serviceability/sa/TestPrintMdo.java
! test/hotspot/jtreg/serviceability/sa/TestType.java
! test/hotspot/jtreg/serviceability/sa/TestUniverse.java

Changeset: ae60ed6f
Author:    Goetz Lindenmaier <goetz at openjdk.org>
Date:      2021-09-23 12:55:50 +0000
URL:       https://git.openjdk.java.net/jdk11u/commit/ae60ed6f0517465bbd164f600c3bccf25d6bb35a

8221903: PIT: javax/swing/RepaintManager/IconifyTest/IconifyTest.java fails on ubuntu18.04

Reviewed-by: mdoerr
Backport-of: e9e86ffb3083b0fdd33a29deb0c7370bc8935065

! test/jdk/javax/swing/RepaintManager/IconifyTest/IconifyTest.java

Changeset: 92e1f21d
Author:    Goetz Lindenmaier <goetz at openjdk.org>
Date:      2021-09-23 12:57:13 +0000
URL:       https://git.openjdk.java.net/jdk11u/commit/92e1f21df3de9417330c5501e0053b2f11bd129f

8242044: Add basic HTTP/1.1 support to the HTTP/2 Test Server

Reviewed-by: mdoerr
Backport-of: 9a69bb807beb6693c68a7b11bee435c0bab7ceac

+ test/jdk/java/net/httpclient/HttpVersionsTest.java
! test/jdk/java/net/httpclient/http2/server/Http2TestServer.java
! test/jdk/java/net/httpclient/http2/server/Http2TestServerConnection.java

Changeset: 7e738413
Author:    Goetz Lindenmaier <goetz at openjdk.org>
Date:      2021-09-23 12:57:57 +0000
URL:       https://git.openjdk.java.net/jdk11u/commit/7e738413aa575cdf7da0fa8d69306045b860eecf

8234802: [TESTBUG] Test Right Mouse Button Drag Gesture Recognition in all the platforms

Backport-of: 24232989ba11778bfe8ea8f5f7b205b955bcb3b1

+ test/jdk/java/awt/dnd/RightMouseButtonDragTest/RightMouseButtonDragTest.java

Changeset: 4f3e0107
Author:    Goetz Lindenmaier <goetz at openjdk.org>
Date:      2021-09-23 12:59:56 +0000
URL:       https://git.openjdk.java.net/jdk11u/commit/4f3e01079ca28abca206b32379e5d491618cc0a9

8242526: PIT: javax/swing/JInternalFrame/8020708/bug8020708.java fails in mach5 ubuntu system
8233644: [TESTBUG] JInternalFrame test bug8020708.java is failing on macos

Backport-of: 8b002d881dc46636d5e9b172ed3566674c6a4eeb

! test/jdk/ProblemList.txt
! test/jdk/javax/swing/JInternalFrame/8020708/bug8020708.java

Changeset: cbe5a58e
Author:    Goetz Lindenmaier <goetz at openjdk.org>
Date:      2021-09-23 13:01:14 +0000
URL:       https://git.openjdk.java.net/jdk11u/commit/cbe5a58e3ac3941d6bda33b6353c1ced41a12ae7

8221902: PIT: javax/swing/JRadioButton/FocusTraversal/FocusTraversal.java fails on ubuntu

Backport-of: 4071546506d33b2bf74dc811b28dd8653f315be6

! test/jdk/ProblemList.txt
! test/jdk/javax/swing/JRadioButton/FocusTraversal/FocusTraversal.java

Changeset: 426906b8
Author:    Christoph Langer <clanger at openjdk.org>
Date:      2021-09-23 16:06:45 +0000
URL:       https://git.openjdk.java.net/jdk11u/commit/426906b8f8c88ce4ac67eafb05ea42acdfc56f85

8210920: Native C++ tests are not using CXXFLAGS

Reviewed-by: mdoerr
Backport-of: 481a045635fd3cafadf2e5314570b1bf6e45ba89

! make/autoconf/flags-cflags.m4
! make/autoconf/flags-ldflags.m4
! make/autoconf/spec.gmk.in
! make/common/TestFilesCompilation.gmk

Changeset: 7b1cf545
Author:    Christoph Langer <clanger at openjdk.org>
Date:      2021-09-24 06:41:47 +0000
URL:       https://git.openjdk.java.net/jdk11u/commit/7b1cf54577361cf43b69e032e79a93601a3af1d1

8180569: Refactor sun/security/krb5/ shell tests to plain java tests

Backport-of: 8b83b515b1981557ab27703482b4c14ca4cdb11c

+ test/jdk/sun/security/krb5/auto/ReplayCacheTestProcWithMD5.java
- test/jdk/sun/security/krb5/auto/rcache_usemd5.sh
! test/jdk/sun/security/krb5/tools/KtabCheck.java
! test/jdk/sun/security/krb5/tools/KtabZero.java
- test/jdk/sun/security/krb5/tools/ktarg.sh
- test/jdk/sun/security/krb5/tools/ktcheck.sh
- test/jdk/sun/security/krb5/tools/ktmissing.sh
- test/jdk/sun/security/krb5/tools/ktzero.sh
! test/lib/jdk/test/lib/SecurityTools.java

Changeset: 3d21c7c5
Author:    Goetz Lindenmaier <goetz at openjdk.org>
Date:      2021-09-24 07:41:43 +0000
URL:       https://git.openjdk.java.net/jdk11u/commit/3d21c7c51b07818077d7a50eb03512e16e69adf4

8238677: java/net/httpclient/ssltest/CertificateTest.java should not specify TLS version

Backport-of: fbca3fa710d8068e39eee574813c35f1d60fabe5

+ test/jdk/java/net/httpclient/ssltest/Cert.java
! test/jdk/java/net/httpclient/ssltest/CertificateTest.java
! test/jdk/java/net/httpclient/ssltest/Server.java
- test/jdk/java/net/httpclient/ssltest/bad.keystore
+ test/jdk/java/net/httpclient/ssltest/gen-certs.sh
- test/jdk/java/net/httpclient/ssltest/good.keystore
- test/jdk/java/net/httpclient/ssltest/loopback.keystore

Changeset: 85b77566
Author:    Martin Doerr <mdoerr at openjdk.org>
Date:      2021-09-24 10:14:02 +0000
URL:       https://git.openjdk.java.net/jdk11u/commit/85b775664fc57031916254b6d1ffa2137467546f

8263773: Reenable German localization for builds at Oracle

Backport-of: ef4a532802096f3958567c2ed22c1b317ac21fbe

! make/conf/jib-profiles.js
! test/jdk/build/translations/VerifyTranslations.java

Changeset: 8bf4dd71
Author:    Goetz Lindenmaier <goetz at openjdk.org>
Date:      2021-09-25 08:03:08 +0000
URL:       https://git.openjdk.java.net/jdk11u/commit/8bf4dd71874135e4b44ef9678cbdd65e3edf311f

8245165: Update bug id for javax/swing/text/StyledEditorKit/4506788/bug4506788.java in ProblemList

Backport-of: 08ded85a5cc27817a7a1d6f2772a7070fff80391

! test/jdk/ProblemList.txt

Changeset: f0e77796
Author:    Goetz Lindenmaier <goetz at openjdk.org>
Date:      2021-09-27 09:03:41 +0000
URL:       https://git.openjdk.java.net/jdk11u/commit/f0e777966b94336ea6b94d0f9d7394ade6bf7782

8169954: JFileChooser/8021253: java.lang.RuntimeException: Default button is not pressed

Backport-of: cacce843aac7380d61c9ef84254744125cccd713

! test/jdk/ProblemList.txt
! test/jdk/javax/swing/JFileChooser/8021253/bug8021253.java

Changeset: 1eb1ce8b
Author:    Goetz Lindenmaier <goetz at openjdk.org>
Date:      2021-09-27 09:06:49 +0000
URL:       https://git.openjdk.java.net/jdk11u/commit/1eb1ce8b58c1d982c3158302561d92d57b80778f

8245665: Test WeakAlg.java should only make sure no warning for weak signature algorithms by keytool on root CA

Backport-of: ccd7d70586e05a06420f30af78746603a424c85e

! test/jdk/sun/security/tools/keytool/WeakAlg.java

Changeset: 8e7259e1
Author:    Goetz Lindenmaier <goetz at openjdk.org>
Date:      2021-09-27 09:09:57 +0000
URL:       https://git.openjdk.java.net/jdk11u/commit/8e7259e1789faf22decba1176eb97cbf6b320dda

8255722: Create a new test for rotated blit

Backport-of: a53b12df2d3a732a05ed79ed12e57f9f0d01fb49

! test/jdk/ProblemList.txt
+ test/jdk/java/awt/image/DrawImage/BlitRotateClippedArea.java

Changeset: 6414dec6
Author:    Goetz Lindenmaier <goetz at openjdk.org>
Date:      2021-09-27 09:13:01 +0000
URL:       https://git.openjdk.java.net/jdk11u/commit/6414dec64a01d94edb57c5380850ef536cd3bcec

8250839: Improve test template SSLEngineTemplate with SSLContextTemplate

Backport-of: 473fa820007b59ecd676b292b3423fcd835712db

! test/jdk/javax/net/ssl/templates/SSLEngineTemplate.java

Changeset: 79118a17
Author:    Goetz Lindenmaier <goetz at openjdk.org>
Date:      2021-09-27 09:15:35 +0000
URL:       https://git.openjdk.java.net/jdk11u/commit/79118a1713764ffca6ddb2329a9b007b2f21f10c

8264824: java/net/Inet6Address/B6206527.java doesn't close ServerSocket properly

Backport-of: 6293299dd341721b33424c7012b1123bb267cabb

! test/jdk/java/net/Inet6Address/B6206527.java

Changeset: 98f17dfa
Author:    Goetz Lindenmaier <goetz at openjdk.org>
Date:      2021-09-27 09:19:07 +0000
URL:       https://git.openjdk.java.net/jdk11u/commit/98f17dfa62863c1255b69594f8ad22e13ed0d5e7

8039261: [TEST_BUG]: There is not a minimal security level in Java Preferences and the TestApplet.html is blocked.

Backport-of: 26186ec3f69d48446f18a5a91ea70d3e7f51436a

- test/jdk/java/awt/Focus/8044614/TestApplet.java
- test/jdk/java/awt/Focus/8044614/applet1.html
- test/jdk/java/awt/Focus/8044614/applet2.html
- test/jdk/java/awt/Focus/8044614/bug8044614.html
- test/jdk/java/awt/Focus/8044614/bug8044614.java
- test/jdk/java/awt/Focus/8044614/main.html
- test/jdk/java/awt/event/KeyEvent/KeyReleasedInAppletTest/KeyReleasedInAppletTest.html
- test/jdk/java/awt/event/KeyEvent/KeyReleasedInAppletTest/KeyReleasedInAppletTest.java
- test/jdk/java/awt/event/KeyEvent/KeyReleasedInAppletTest/TestApplet.java

Changeset: 45906dc1
Author:    Christoph Langer <clanger at openjdk.org>
Date:      2021-09-28 04:46:42 +0000
URL:       https://git.openjdk.java.net/jdk11u/commit/45906dc1e01c18db30ebe761b022805053cad536

8223658: Performance regression of XML.validation in 13-b19

Reviewed-by: sviswanathan
Backport-of: 50eb86d003e88109beb70726f897ad18e96a2a81

! src/java.xml/share/classes/com/sun/org/apache/xerces/internal/dom/DeferredDocumentImpl.java

Changeset: d7ac85ab
Author:    Goetz Lindenmaier <goetz at openjdk.org>
Date:      2021-09-28 08:03:15 +0000
URL:       https://git.openjdk.java.net/jdk11u/commit/d7ac85abaed368b46940ee81cd0a6ae27defb643

8244292: Headful clients failing with --illegal-access=deny

Reviewed-by: mdoerr
Backport-of: 0efacb3eedf79dceb6aa185057df2658ce899723

! test/jdk/com/sun/java/swing/plaf/windows/RevalidateOnPropertyChange.java
! test/jdk/java/awt/Toolkit/DisplayChangesException/DisplayChangesException.java
! test/jdk/java/awt/event/SequencedEvent/MultipleContextsUnitTest.java

Changeset: d234b6d4
Author:    Goetz Lindenmaier <goetz at openjdk.org>
Date:      2021-09-28 08:04:05 +0000
URL:       https://git.openjdk.java.net/jdk11u/commit/d234b6d4ea9636a943b3a16dfbdadf1569d32e76

8230019: [REDO] compiler/types/correctness/* tests fail with "assert(recv == __null || recv->is_klass()) failed: wrong type"

Explicitly set the receiver klass in the ci MDO to NULL if it is NULL in the MDO while translating.

Reviewed-by: mdoerr
Backport-of: 6df28153fd7c5371a6b92f62addf03465ecf4eee

! src/hotspot/share/ci/ciMethodData.cpp
! test/hotspot/jtreg/ProblemList.txt

Changeset: 14761580
Author:    Goetz Lindenmaier <goetz at openjdk.org>
Date:      2021-09-28 08:05:22 +0000
URL:       https://git.openjdk.java.net/jdk11u/commit/14761580363e515055a88fbf799e6c6ad9b94910

8216417: cleanup of IPv6 scope-id handling

Reviewed-by: mdoerr
Backport-of: 247a6a2ce4f890252ec256de107c1fc4b898aaf6

! src/java.base/share/classes/java/net/AbstractPlainDatagramSocketImpl.java
! src/java.base/share/classes/java/net/AbstractPlainSocketImpl.java
! src/java.base/share/classes/java/net/Inet6Address.java
! src/java.base/share/classes/sun/net/util/IPAddressUtil.java
! src/java.base/share/classes/sun/nio/ch/DatagramChannelImpl.java
! src/java.base/share/classes/sun/nio/ch/Net.java
! src/java.base/share/native/libnet/Inet6Address.c
! src/java.base/share/native/libnet/net_util.h
! src/java.base/unix/classes/java/net/PlainDatagramSocketImpl.java
! src/java.base/unix/native/libnet/Inet6AddressImpl.c
! src/java.base/unix/native/libnet/PlainDatagramSocketImpl.c
! src/java.base/unix/native/libnet/PlainSocketImpl.c
! src/java.base/unix/native/libnet/net_util_md.c
! src/java.base/unix/native/libnet/net_util_md.h
! src/java.base/windows/classes/java/net/DualStackPlainDatagramSocketImpl.java
! src/java.base/windows/classes/java/net/TwoStacksPlainDatagramSocketImpl.java
! src/java.base/windows/native/libnet/TwoStacksPlainDatagramSocketImpl.c
! src/java.base/windows/native/libnet/net_util_md.c
+ test/jdk/java/net/Inet6Address/Scoping.java
+ test/jdk/java/net/MulticastSocket/PromiscuousIPv6.java
! test/jdk/java/net/ipv6tests/B6521014.java
+ test/jdk/java/nio/channels/DatagramChannel/PromiscuousIPv6.java

Changeset: b433235d
Author:    Goetz Lindenmaier <goetz at openjdk.org>
Date:      2021-09-28 08:06:56 +0000
URL:       https://git.openjdk.java.net/jdk11u/commit/b433235d3b9bc475fe1445d6e8a38d6b748e39fa

8081652: [TESTBUG] java/lang/management/ThreadMXBean/ThreadMXBeanStateTest.java timed out intermittently

Reviewed-by: mdoerr
Backport-of: 5805cbeaaf72657bbd758766d47261dd5c74e70b

! test/jdk/ProblemList.txt
! test/jdk/java/lang/Thread/ThreadStateController.java
! test/jdk/java/lang/management/ThreadMXBean/ThreadMXBeanStateTest.java

Changeset: d3a8a9ea
Author:    Goetz Lindenmaier <goetz at openjdk.org>
Date:      2021-09-28 08:09:09 +0000
URL:       https://git.openjdk.java.net/jdk11u/commit/d3a8a9ea1352e0b3d51e540254014e66baea6125

8253497: Core Libs Terminology Refresh

Reviewed-by: mdoerr
Backport-of: b2f035549a510be7c19f3d101daa0fd8f05843ac

! make/jdk/src/classes/build/tools/generatelsrequivmaps/EquivMapsGenerator.java
! src/java.base/share/classes/java/io/ObjectInputFilter.java
! src/java.base/share/classes/java/util/Locale.java
! src/java.base/share/classes/jdk/internal/logger/BootstrapLogger.java
! src/java.base/share/classes/sun/util/locale/LanguageTag.java
! src/java.management.rmi/share/classes/javax/management/remote/rmi/RMIConnectorServer.java
! src/java.rmi/share/classes/sun/rmi/registry/RegistryImpl.java
! src/java.rmi/share/classes/sun/rmi/transport/DGCImpl.java
! test/jdk/java/lang/ClassLoader/Assert.java
! test/jdk/java/lang/management/ClassLoadingMXBean/LoadCounts.java
! test/jdk/java/nio/channels/AsynchronousFileChannel/Lock.java
! test/jdk/java/nio/channels/SocketChannel/CloseRegisteredChannel.java
! test/jdk/java/util/Locale/LSRDataTest.java
! test/jdk/java/util/Locale/LocaleEnhanceTest.java
! test/jdk/javax/management/remote/mandatory/connection/DefaultAgentFilterTest.java

Changeset: 9121f555
Author:    Goetz Lindenmaier <goetz at openjdk.org>
Date:      2021-09-28 08:10:08 +0000
URL:       https://git.openjdk.java.net/jdk11u/commit/9121f555c54be40cb9c99af4296bded6bed3d2a3

8253866: Security Libs Terminology Refresh

Reviewed-by: mdoerr
Backport-of: 8554fe6ebce7811a0c3b4670a89e3c07d577d966

! make/ToolsJdk.gmk
= make/data/blockedcertsconverter/blocked.certs.pem
! make/gendata/Gendata-java.base.gmk
- make/gendata/GendataBlacklistedCerts.gmk
+ make/gendata/GendataBlockedCerts.gmk
= make/jdk/src/classes/build/tools/blockedcertsconverter/BlockedCertsConverter.java
! make/scripts/compare.sh
! src/java.base/share/classes/com/sun/crypto/provider/JceKeyStore.java
! src/java.base/share/classes/java/util/jar/JarVerifier.java
! src/java.base/share/classes/sun/security/provider/JavaKeyStore.java
! src/java.base/share/classes/sun/security/util/UntrustedCertificates.java
! src/java.base/share/conf/security/java.security
! src/java.security.jgss/share/classes/sun/security/krb5/Config.java
! src/java.security.jgss/share/classes/sun/security/krb5/KdcComm.java
! test/jdk/sun/security/krb5/auto/BogusKDC.java
- test/jdk/sun/security/lib/CheckBlacklistedCerts.java
+ test/jdk/sun/security/lib/CheckBlockedCerts.java

Changeset: d655d00f
Author:    Goetz Lindenmaier <goetz at openjdk.org>
Date:      2021-09-28 08:11:55 +0000
URL:       https://git.openjdk.java.net/jdk11u/commit/d655d00f5f8d878cccf670afa8a3775210904dab

8265019: Update tests for additional TestNG test permissions

Reviewed-by: mdoerr
Backport-of: ffb3771816910d2eddba367812e57a9c5459ff8c

! test/jdk/java/lang/ProcessHandle/PermissionTest.java
! test/jdk/java/sql/testng/util/TestPolicy.java

Changeset: 8d780729
Author:    Goetz Lindenmaier <goetz at openjdk.org>
Date:      2021-09-28 08:13:26 +0000
URL:       https://git.openjdk.java.net/jdk11u/commit/8d780729c65bbfd19f23004723b8786d52f8310a

8258855: Two tests sun/security/krb5/auto/ReplayCacheTestProc.java and ReplayCacheTestProcWithMD5.java failed on OL8.3

Reviewed-by: mdoerr
Backport-of: d70fd7b3c40ae6cb548bd85e87df5435fd4c65bf

! test/jdk/sun/security/krb5/auto/ReplayCacheTestProc.java
! test/jdk/sun/security/krb5/auto/ReplayCacheTestProcWithMD5.java

Changeset: c9855f11
Author:    Goetz Lindenmaier <goetz at openjdk.org>
Date:      2021-09-28 08:15:11 +0000
URL:       https://git.openjdk.java.net/jdk11u/commit/c9855f114de786491dedf72b947d9f0bb7c30b2b

8233564: [TESTBUG] MouseComboBoxTest.java is failing

Backport-of: b72d99e77b71e495fe66026f692f28d5407235ce

! test/jdk/ProblemList.txt
! test/jdk/java/awt/Mouse/MouseComboBoxTest/MouseComboBoxTest.java

Changeset: c3bdce8f
Author:    Goetz Lindenmaier <goetz at openjdk.org>
Date:      2021-09-28 08:16:11 +0000
URL:       https://git.openjdk.java.net/jdk11u/commit/c3bdce8f5935339c701235ab0dbed2d2540eafbf

8163086: java/awt/Window/TranslucentJAppletTest/TranslucentJAppletTest.java fails

Backport-of: abdff7905f3aacd54cccc29c5b7922c87301f7fe

! test/jdk/ProblemList.txt
! test/jdk/java/awt/Window/TranslucentJAppletTest/TranslucentJAppletTest.java

Changeset: 3dc942c2
Author:    Goetz Lindenmaier <goetz at openjdk.org>
Date:      2021-09-28 12:22:37 +0000
URL:       https://git.openjdk.java.net/jdk11u/commit/3dc942c2f336087a6b66ea4ecefc6bb9acefd4ce

8047218: [TEST_BUG] java/awt/FullScreen/AltTabCrashTest/AltTabCrashTest.java fails with exception

Backport-of: 271a0c713322bef3c78b04665c333c5e3068f8a9

! test/jdk/ProblemList.txt
! test/jdk/java/awt/FullScreen/AltTabCrashTest/AltTabCrashTest.java

Changeset: d896cda7
Author:    Goetz Lindenmaier <goetz at openjdk.org>
Date:      2021-09-28 12:23:22 +0000
URL:       https://git.openjdk.java.net/jdk11u/commit/d896cda7f8e134052948c5b2fc34796fb948ad4d

8248341: ProblemList java/lang/management/ThreadMXBean/ThreadMXBeanStateTest.java

Backport-of: 8a424425e1594dbddd4de517fa5f51b5e7382fd8

! test/jdk/ProblemList.txt

Changeset: 654ad1c2
Author:    Goetz Lindenmaier <goetz at openjdk.org>
Date:      2021-09-28 12:24:16 +0000
URL:       https://git.openjdk.java.net/jdk11u/commit/654ad1c2872f18a68beaf398132cacf44894c6b9

8266949: Check possibility to disable OperationTimedOut on Unix

Backport-of: e6705c0e4b548a83197c3ea70bdef25ec65d4c00

! src/java.desktop/share/classes/sun/awt/SunToolkit.java
! src/java.desktop/unix/classes/sun/awt/X11/XToolkit.java

Changeset: cb4e2876
Author:    Goetz Lindenmaier <goetz at openjdk.org>
Date:      2021-09-28 12:32:57 +0000
URL:       https://git.openjdk.java.net/jdk11u/commit/cb4e2876265bdc72b25c0624338256e197b542f4

8255227: java/net/httpclient/FlowAdapterPublisherTest.java intermittently failing with TestServer: start exception: java.io.IOException: Invalid preface

Backport-of: 0544a732a44309bf7cbb44846dd9320c6096de17

! src/java.net.http/share/classes/jdk/internal/net/http/Stream.java
! test/jdk/java/net/httpclient/http2/server/Http2TestServerConnection.java

Changeset: ba3cc922
Author:    Zhengyu Gu <zgu at openjdk.org>
Date:      2021-09-28 17:13:52 +0000
URL:       https://git.openjdk.java.net/jdk11u/commit/ba3cc92209723168ec10cfe242461fb369f71ae8

8213707: [TEST] vmTestbase/nsk/stress/except/except011.java failed due to wrong class name

Fixed wrong class name in test

Backport-of: 83155e1ea6aa0f5243718847fe5cbfbda5db96a8

! test/hotspot/jtreg/vmTestbase/nsk/stress/except/except011.java

Changeset: b4b50cb1
Author:    Goetz Lindenmaier <goetz at openjdk.org>
Date:      2021-09-29 07:18:00 +0000
URL:       https://git.openjdk.java.net/jdk11u/commit/b4b50cb12d2031e24ba089c7196d4f095313e38c

Merge


Changeset: 11659aa6
Author:    Martin Doerr <mdoerr at openjdk.org>
Date:      2021-09-29 09:46:18 +0000
URL:       https://git.openjdk.java.net/jdk11u/commit/11659aa62fa94e001655433e045b950c232208c1

8274056: JavaAccessibilityUtilities leaks JNI objects

Backport-of: 42d5d2abaad8a88a5e1326ea8b4494aeb8b5748b

! src/java.desktop/macosx/native/libawt_lwawt/awt/JavaAccessibilityUtilities.m

Changeset: 2baf9ea2
Author:    Goetz Lindenmaier <goetz at openjdk.org>
Date:      2021-09-30 07:03:39 +0000
URL:       https://git.openjdk.java.net/jdk11u/commit/2baf9ea2d7fc31a215cb51ee2d4b55276dd259c8

8179880: Refactor javax/security shell tests to plain java tests

Reviewed-by: mdoerr
Backport-of: 7f55dc15769bbab59024aa49671bced633de40ed

! test/jdk/javax/security/auth/Subject/doAs/Test.java
- test/jdk/javax/security/auth/Subject/doAs/Test.sh

Changeset: 245ccb2e
Author:    Goetz Lindenmaier <goetz at openjdk.org>
Date:      2021-09-30 07:04:47 +0000
URL:       https://git.openjdk.java.net/jdk11u/commit/245ccb2e6c08e6aa26692ec470326ab1d0643218

8269768: JFR Terminology Refresh

Backport-of: 1c18f914386a7543a95984294c6d61004c0a7176

! src/jdk.jfr/share/classes/jdk/jfr/AnnotationElement.java

Changeset: 97859e83
Author:    Goetz Lindenmaier <goetz at openjdk.org>
Date:      2021-09-30 07:06:00 +0000
URL:       https://git.openjdk.java.net/jdk11u/commit/97859e836809e33da0ede6db5c0f6410cad24ba9

8268093: Manual Testcase: "sun/security/krb5/config/native/TestDynamicStore.java" Fails with NPE

Backport-of: e39346e708a06cdee2b9a096f08c1cfe2e21dfc2

! test/jdk/sun/security/krb5/config/native/TestDynamicStore.java
! test/jdk/sun/security/krb5/config/native/libTestDynamicStore.m

Changeset: f1391712
Author:    Martin Doerr <mdoerr at openjdk.org>
Date:      2021-09-30 08:40:58 +0000
URL:       https://git.openjdk.java.net/jdk11u/commit/f1391712c213a1f106ee7a13bb39cc82067ad832

8215889: assert(!_unloading) failed: This oop is not available to unloading class loader data with ZGC

Reviewed-by: goetz, zgu
Backport-of: f08eeac278b0785c0bdff0bddf46b66f65822357

! src/hotspot/share/ci/ciEnv.hpp
! src/hotspot/share/ci/ciMethodData.cpp
! src/hotspot/share/ci/ciMethodData.hpp
! src/hotspot/share/ci/ciObjectFactory.cpp
! src/hotspot/share/ci/ciObjectFactory.hpp
! src/hotspot/share/oops/instanceKlass.cpp
! src/hotspot/share/oops/methodData.cpp
! src/hotspot/share/oops/methodData.hpp

Changeset: e5b1dbfb
Author:    Martin Doerr <mdoerr at openjdk.org>
Date:      2021-09-30 08:53:57 +0000
URL:       https://git.openjdk.java.net/jdk11u/commit/e5b1dbfb6ded8688c969a6540d5b29c5aa22a43f

8231501: VM crash in MethodData::clean_extra_data(CleanExtraDataClosure*):  fatal error: unexpected tag 99

Snapshot MDO extra trap and argument data only after it is prepared.

Reviewed-by: phh
Backport-of: 49048adcf206034e8cfe2877029bfa5523c9eb4c

! src/hotspot/share/ci/ciMethodData.cpp
! src/hotspot/share/ci/ciMethodData.hpp
! src/hotspot/share/oops/methodData.hpp

Changeset: 89d4ef24
Author:    Jonathan Dowland <jdowland at openjdk.org>
Committer: Christoph Langer <clanger at openjdk.org>
Date:      2021-09-30 10:30:33 +0000
URL:       https://git.openjdk.java.net/jdk11u/commit/89d4ef2413ff4aa1fd2b10b4d2c6fbfcad8bdf5e

8078219: Verify lack of @test tag in files in java/net test directory

Backport-of: a9f92bec7f3acd333742cb726e80bd487a0cdb0d

! test/jdk/java/net/MulticastSocket/MulticastAddresses.java
! test/jdk/java/net/MulticastSocket/Reuse.java
! test/jdk/java/net/URLClassLoader/GetURLsTest.java

Changeset: dce04a25
Author:    Jonathan Dowland <jdowland at openjdk.org>
Committer: Christoph Langer <clanger at openjdk.org>
Date:      2021-09-30 10:35:07 +0000
URL:       https://git.openjdk.java.net/jdk11u/commit/dce04a257c0790f26092d7406acada4110dfd7ac

8272342: [TEST_BUG] java/awt/print/PrinterJob/PageDialogMarginTest.java catches all exceptions

Backport-of: a5ad7720d235610ad45fc341c61f164805f82a54

! test/jdk/java/awt/print/PrinterJob/PageDialogMarginTest.java

Changeset: 05cb444e
Author:    Jonathan Dowland <jdowland at openjdk.org>
Committer: Christoph Langer <clanger at openjdk.org>
Date:      2021-09-30 10:37:27 +0000
URL:       https://git.openjdk.java.net/jdk11u/commit/05cb444eadf79546d6f5b8b6ca84af071a9ef8db

8180571: Refactor sun/security/pkcs11 shell tests to plain java tests and fix failures

Co-authored-by: Jonathan Dowland <jdowland at openjdk.org>
Reviewed-by: goetz
Backport-of: ccfcd926674ee0bd88f34b16b489abe008169b11

! test/jdk/ProblemList.txt
! test/jdk/sun/security/pkcs11/Config/ReadConfInUTF16Env.java
- test/jdk/sun/security/pkcs11/Config/ReadConfInUTF16Env.sh
! test/jdk/sun/security/pkcs11/KeyStore/Basic.java
- test/jdk/sun/security/pkcs11/KeyStore/Basic.sh
! test/jdk/sun/security/pkcs11/KeyStore/ClientAuth.java
- test/jdk/sun/security/pkcs11/KeyStore/ClientAuth.sh
! test/jdk/sun/security/pkcs11/KeyStore/ClientAuthData/cert8.db
! test/jdk/sun/security/pkcs11/KeyStore/ClientAuthData/key3.db
! test/jdk/sun/security/pkcs11/KeyStore/ClientAuthData/secmod.db
! test/jdk/sun/security/pkcs11/KeyStore/ClientAuthData/truststore
! test/jdk/sun/security/pkcs11/KeyStore/SecretKeysBasic.java
- test/jdk/sun/security/pkcs11/KeyStore/SecretKeysBasic.sh
! test/jdk/sun/security/pkcs11/PKCS11Test.java
! test/jdk/sun/security/pkcs11/Provider/ConfigQuotedString.java
- test/jdk/sun/security/pkcs11/Provider/ConfigQuotedString.sh
! test/jdk/sun/security/pkcs11/Provider/Login.java
- test/jdk/sun/security/pkcs11/Provider/Login.sh

Changeset: b9f01439
Author:    Christoph Langer <clanger at openjdk.org>
Date:      2021-09-30 10:38:28 +0000
URL:       https://git.openjdk.java.net/jdk11u/commit/b9f01439e9277be2b990ed3bfc513a05651c3c29

8196096: javax/swing/JPopupMenu/6580930/bug6580930.java fails

Reviewed-by: mdoerr
Backport-of: b5b24b904a68432153e8fa5c10cab5c27e871722

! test/jdk/ProblemList.txt
! test/jdk/javax/swing/JPopupMenu/6580930/bug6580930.java

Changeset: b79e707f
Author:    Goetz Lindenmaier <goetz at openjdk.org>
Date:      2021-09-30 11:54:57 +0000
URL:       https://git.openjdk.java.net/jdk11u/commit/b79e707f8783b5f939673b19fdb22b596c353edb

8269426: Rename test/jdk/java/lang/invoke/t8150782 to accessClassAndFindClass

Reviewed-by: mdoerr
Backport-of: 56240690f62f9048a45a53525efccffdec235a8d

= test/jdk/java/lang/invoke/accessClassAndFindClass/TestAccessClass.java
= test/jdk/java/lang/invoke/accessClassAndFindClass/TestCls.java
= test/jdk/java/lang/invoke/accessClassAndFindClass/TestFindClass.java
= test/jdk/java/lang/invoke/accessClassAndFindClass/TestLookup.java

Changeset: ed980600
Author:    Goetz Lindenmaier <goetz at openjdk.org>
Date:      2021-09-30 11:55:50 +0000
URL:       https://git.openjdk.java.net/jdk11u/commit/ed980600b6dde0f21f6576066da27d71f7b7421f

8223137: Rename predicate 'do_unroll_only()' to 'is_unroll_only()'.

Backport-of: fcbca8224766a41659774acff0145dc1aee7d52f

! src/hotspot/share/opto/loopTransform.cpp
! src/hotspot/share/opto/loopUnswitch.cpp
! src/hotspot/share/opto/loopnode.cpp
! src/hotspot/share/opto/loopnode.hpp
! src/hotspot/share/opto/superword.cpp

Changeset: 23c3845e
Author:    Goetz Lindenmaier <goetz at openjdk.org>
Date:      2021-09-30 11:57:00 +0000
URL:       https://git.openjdk.java.net/jdk11u/commit/23c3845e8cb77a6a8aeefaedfb3df9a7987ce062

8229935: [TEST_BUG]: bug8132119.java inconsistently positions text

Backport-of: 5686851c12e63339e492c56b63a3e3dfc2fae466

! test/jdk/ProblemList.txt
! test/jdk/javax/swing/plaf/basic/BasicGraphicsUtils/8132119/bug8132119.java

Changeset: a6ee356b
Author:    Christoph Langer <clanger at openjdk.org>
Date:      2021-10-01 12:59:01 +0000
URL:       https://git.openjdk.java.net/jdk11u/commit/a6ee356b21ad0db1789be4fa435d38685d7ad85c

8234823: java/net/Socket/Timeouts.java testcase testTimedConnect2() fails on Windows 10

Backport-of: a2fad13ce29e6de9b9dead7da49de7c0544d32c6

! test/jdk/java/net/Socket/Timeouts.java

Changeset: 9f8c13c4
Author:    Jonathan Dowland <jdowland at openjdk.org>
Committer: Christoph Langer <clanger at openjdk.org>
Date:      2021-10-01 14:40:22 +0000
URL:       https://git.openjdk.java.net/jdk11u/commit/9f8c13c42b40bdb7605d993b6dc51f3e71b63f83

8233569: [TESTBUG] JTextComponent test bug6361367.java fails on macos

Backport-of: 518ff518e1f90bf195c56b5f935bffa07059ee6b

! test/jdk/ProblemList.txt
! test/jdk/javax/swing/text/JTextComponent/6361367/bug6361367.java

Changeset: f7a75ded
Author:    Goetz Lindenmaier <goetz at openjdk.org>
Date:      2021-10-01 16:46:54 +0000
URL:       https://git.openjdk.java.net/jdk11u/commit/f7a75dede86ff8b96a43bbcb35ff40c3a8092eee

8265524: Upgrading JSZip from v3.2.2 to v3.6.0

Reviewed-by: mdoerr

! src/jdk.javadoc/share/classes/jdk/javadoc/internal/doclets/formats/html/resources/jquery/jszip/dist/jszip.js
! src/jdk.javadoc/share/classes/jdk/javadoc/internal/doclets/formats/html/resources/jquery/jszip/dist/jszip.min.js
! src/jdk.javadoc/share/legal/jszip.md

Changeset: 2990ff06
Author:    Goetz Lindenmaier <goetz at openjdk.org>
Date:      2021-10-01 16:47:59 +0000
URL:       https://git.openjdk.java.net/jdk11u/commit/2990ff065935cc2a2b487fb88335e58b7edaa6cf

8211171: move JarUtils to top-level testlibrary

Reviewed-by: mdoerr
Backport-of: ab8c7f710c8a4c46fc2f2a295c921054a30a7d2f

- test/jaxp/javax/xml/jaxp/libs/jaxp/library/JarUtils.java
! test/jaxp/javax/xml/jaxp/unittest/catalog/CatalogFileInputTest.java
! test/jdk/java/io/FilePermission/ReadFileOnPath.java
! test/jdk/java/io/Serializable/packageAccess/PackageAccessTest.java
! test/jdk/java/io/Serializable/resolveClass/consTest/ConsTest.java
! test/jdk/java/io/Serializable/resolveClass/consTest/SetupJar.java
! test/jdk/java/io/Serializable/resolveClass/deserializeButton/DeserializeButtonTest.java
! test/jdk/java/io/Serializable/superclassDataLoss/SuperclassDataLossTest.java
! test/jdk/java/lang/ClassLoader/forNameLeak/ClassForNameLeak.java
! test/jdk/java/lang/ClassLoader/getResource/automaticmodules/Driver.java
! test/jdk/java/lang/ClassLoader/securityManager/ClassLoaderTest.java
! test/jdk/java/lang/Package/IsCompatibleWithDriver.java
! test/jdk/java/lang/Package/PackageFromManifest.java
! test/jdk/java/lang/instrument/executableJAR/ExecJarWithAgent.java
! test/jdk/java/lang/module/AutomaticModulesTest.java
! test/jdk/java/lang/module/ModuleReader/ModuleReaderTest.java
! test/jdk/java/lang/module/MultiReleaseJarTest.java
! test/jdk/java/lang/module/customfs/ModulesInCustomFileSystem.java
! test/jdk/java/net/URLClassLoader/closetest/CloseTest.java
! test/jdk/java/net/URLClassLoader/closetest/GetResourceAsStream.java
! test/jdk/java/nio/channels/AsynchronousChannelGroup/AsExecutor.java
! test/jdk/java/nio/channels/AsynchronousChannelGroup/SetupJar.java
! test/jdk/java/nio/charset/spi/CharsetProviderBasicTest.java
! test/jdk/java/nio/charset/spi/SetupJar.java
! test/jdk/java/rmi/module/ModuleTest.java
! test/jdk/java/security/Provider/SecurityProviderModularTest.java
! test/jdk/java/util/ServiceLoader/ModulesTest.java
! test/jdk/java/util/ServiceLoader/basic/ServiceLoaderBasicTest.java
! test/jdk/javax/naming/spi/FactoryCacheTest.java
! test/jdk/javax/security/auth/login/modules/JaasModularClientTest.java
! test/jdk/javax/security/auth/login/modules/JaasModularDefaultHandlerTest.java
! test/jdk/jdk/modules/scenarios/automaticmodules/RunWithAutomaticModules.java
- test/jdk/lib/testlibrary/JarUtils.java
! test/jdk/sun/net/www/protocol/jar/jarbug/TestDriver.java
! test/jdk/tools/jlink/basic/BasicTest.java
! test/jdk/tools/launcher/modules/addexports/manifest/AddExportsAndOpensInManifest.java
! test/jdk/tools/launcher/modules/addreads/AddReadsTest.java
! test/jdk/tools/launcher/modules/illegalaccess/IllegalAccessTest.java
! test/jdk/tools/launcher/modules/patch/basic/PatchTest.java
! test/jdk/tools/launcher/modules/patch/basic/PatchTestWarningError.java
! test/jdk/tools/launcher/modules/validate/ValidateModulesTest.java
! test/lib/jdk/test/lib/util/JarUtils.java

Changeset: 09ad2c04
Author:    Goetz Lindenmaier <goetz at openjdk.org>
Date:      2021-10-04 07:06:57 +0000
URL:       https://git.openjdk.java.net/jdk11u/commit/09ad2c0414e9e15d4e272eb956075ab044c79018

8256152: tests fail because of ambiguous method resolution

Backport-of: 646c20022c73258bebf7c55b3e1992b62f5de042

! test/jdk/java/util/stream/boottest/java.base/java/util/stream/DoubleNodeTest.java

Changeset: 6a784d21
Author:    Goetz Lindenmaier <goetz at openjdk.org>
Date:      2021-10-04 07:09:14 +0000
URL:       https://git.openjdk.java.net/jdk11u/commit/6a784d218961b6f9df0806753fbd13530b10d41e

8143021: [TEST_BUG] Test javax/swing/JColorChooser/Test6541987.java fails

Backport-of: 7597cba92b9f08e9b7d5c116b70054cd0dcee50d

! test/jdk/ProblemList.txt
! test/jdk/javax/swing/JColorChooser/Test6541987.java

Changeset: e1cbfa51
Author:    Goetz Lindenmaier <goetz at openjdk.org>
Date:      2021-10-04 07:11:10 +0000
URL:       https://git.openjdk.java.net/jdk11u/commit/e1cbfa51f6bff71baab259c298468ac2a38ec4e8

8248187: [TESTBUG] javax/swing/plaf/basic/BasicGraphicsUtils/8132119/bug8132119.java fails with String is not properly drawn

Backport-of: c3ec97d41af9e9e957b21ac1605a2c7c90d63217

! test/jdk/javax/swing/plaf/basic/BasicGraphicsUtils/8132119/bug8132119.java

Changeset: 28dec4f3
Author:    Goetz Lindenmaier <goetz at openjdk.org>
Date:      2021-10-04 07:12:01 +0000
URL:       https://git.openjdk.java.net/jdk11u/commit/28dec4f39f75a6dcb5835a2d58440871bd38bddf

8223139: Rename mandatory policy-do routines.

Rename 'policy_do_remove_empty_loop' to 'do_remove_empty_loop', 'policy_do_one_iteration_loop' to 'do_one_iteration_loop'.

Backport-of: ceef0f69dcde777e7fdb6ccccb576ab44def716b

! src/hotspot/share/opto/loopTransform.cpp
! src/hotspot/share/opto/loopnode.hpp

Changeset: f12af7e0
Author:    Jonathan Dowland <jdowland at openjdk.org>
Committer: Christoph Langer <clanger at openjdk.org>
Date:      2021-10-04 07:15:21 +0000
URL:       https://git.openjdk.java.net/jdk11u/commit/f12af7e06c128b2771c4a5e9d83f0947755e4db6

8266182: Automate manual steps listed in the test jdk/sun/security/pkcs12/ParamsTest.java

Reviewed-by: goetz, clanger
Backport-of: 9248bd08cf6d16aca27ea1b00506736fc0544070

+ test/jdk/sun/security/pkcs12/KeytoolOpensslInteropTest.java
- test/jdk/sun/security/pkcs12/ParamsTest.java
+ test/lib/jdk/test/lib/artifacts/OpensslArtifactFetcher.java

Changeset: 89ee6116
Author:    Aleksey Shipilev <shade at openjdk.org>
Date:      2021-10-04 12:37:17 +0000
URL:       https://git.openjdk.java.net/jdk11u/commit/89ee6116cf238330e868b1c76252638aae795595

8223923: C2: Missing interference with mismatched unsafe accesses

Backport-of: 86add21a85ec57de00aecb0a18bc99567a91d0d8

! src/hotspot/share/opto/memnode.cpp
+ test/hotspot/jtreg/compiler/unsafe/MismatchedUnsafeAccessTest.java

Changeset: 62851233
Author:    Goetz Lindenmaier <goetz at openjdk.org>
Date:      2021-10-04 19:31:33 +0000
URL:       https://git.openjdk.java.net/jdk11u/commit/62851233d3a5bc17061f2630492e0bd38f805d30

8268555: Update HttpClient tests that use ITestContext to jtreg 6+1

Reviewed-by: mdoerr
Backport-of: da043e99b830fa4fcbfdbdbed182abc394ba6fb1

! test/jdk/java/net/httpclient/AbstractThrowingPublishers.java
! test/jdk/java/net/httpclient/AbstractThrowingPushPromises.java
! test/jdk/java/net/httpclient/AbstractThrowingSubscribers.java
! test/jdk/java/net/httpclient/ForbiddenHeadTest.java
! test/jdk/java/net/httpclient/ProxySelectorTest.java
! test/jdk/java/net/httpclient/Response204V2Test.java
! test/jdk/java/net/httpclient/ShortResponseBody.java

Changeset: 3b88f74d
Author:    Zhengyu Gu <zgu at openjdk.org>
Date:      2021-10-04 20:06:38 +0000
URL:       https://git.openjdk.java.net/jdk11u/commit/3b88f74d71df9132daa405cf749a68ed1ad1330a

8187649: ArrayIndexOutOfBoundsException in java.util.JapaneseImperialCalendar

Backport-of: bea4109ef75a6536af4296db56e6ec90ab0f30fc

! src/java.base/share/classes/java/util/JapaneseImperialCalendar.java
! test/jdk/java/util/Calendar/CalendarTestScripts/JapaneseTests.java
! test/jdk/java/util/Calendar/CalendarTestScripts/japanese/japanese_roll.cts

Changeset: d86cf10b
Author:    Goetz Lindenmaier <goetz at openjdk.org>
Date:      2021-10-04 20:18:05 +0000
URL:       https://git.openjdk.java.net/jdk11u/commit/d86cf10b3425878f58cfdc7dc725905b4d94bf2f

8223138: Small clean-up in loop-tree support.

Rename predicate 'is_inner()' to 'is_innermost()' to be accurate. Added 'is_root()' predicate for root parent test in loop-tree. Changed definition of 'is_loop()' to always lazy-read the tail, since it should never be NULL. Cleanup of 'tail()' definition.

Backport-of: 205085d8d5143c0d8517bcfc021457492a329c18

! src/hotspot/share/opto/loopTransform.cpp
! src/hotspot/share/opto/loopnode.cpp
! src/hotspot/share/opto/loopnode.hpp

Changeset: 6f51eb46
Author:    Aleksey Shipilev <shade at openjdk.org>
Date:      2021-10-05 08:01:35 +0000
URL:       https://git.openjdk.java.net/jdk11u/commit/6f51eb468b19ab6b61f2175ee5ebe2e4f986caab

8273373: Zero: Cannot invoke JVM in primordial threads on Zero

Backport-of: 0f31d0fb2c0d5db305e75e1d61bcc44de3e77839

! src/hotspot/os/linux/os_linux.cpp
! src/hotspot/os_cpu/linux_zero/os_linux_zero.cpp

Changeset: a2bd0a93
Author:    Aleksey Shipilev <shade at openjdk.org>
Date:      2021-10-05 08:02:54 +0000
URL:       https://git.openjdk.java.net/jdk11u/commit/a2bd0a93efc8cb12fe6fb8d772122ae65e755ea4

8272836: Limit run time for java/lang/invoke/LFCaching tests

Backport-of: a3308af0605bf936d9a9fb7093787a315ccc1e2a

! test/jdk/java/lang/invoke/LFCaching/LambdaFormTestCase.java

Changeset: 2b9261aa
Author:    Aleksey Shipilev <shade at openjdk.org>
Date:      2021-10-05 08:03:36 +0000
URL:       https://git.openjdk.java.net/jdk11u/commit/2b9261aa88062c46f60b805fbc19490d65e73683

8273894: ConcurrentModificationException raised every time ReferralsCache drops referral

Backport-of: 2166ed136917bb68f8155a25e4f4a6c5c7115566

! src/java.security.jgss/share/classes/sun/security/krb5/internal/ReferralsCache.java

Changeset: efef574b
Author:    Christoph Langer <clanger at openjdk.org>
Date:      2021-10-05 10:59:42 +0000
URL:       https://git.openjdk.java.net/jdk11u/commit/efef574b741a49755ee6a95ad46c205012dd52f0

8180573: Refactor sun/security/tools shell tests to plain java tests

Reviewed-by: mdoerr
Backport-of: 15aae2f622fc0b1104d8adbcbd87792168538463

+ test/jdk/sun/security/tools/jarsigner/AlgOptions.java
- test/jdk/sun/security/tools/jarsigner/AlgOptions.sh
+ test/jdk/sun/security/tools/jarsigner/CertPolicy.java
+ test/jdk/sun/security/tools/jarsigner/CheckUsage.java
+ test/jdk/sun/security/tools/jarsigner/Collator.java
+ test/jdk/sun/security/tools/jarsigner/ConciseJarsigner.java
+ test/jdk/sun/security/tools/jarsigner/Crl.java
+ test/jdk/sun/security/tools/jarsigner/DefaultOptions.java
+ test/jdk/sun/security/tools/jarsigner/DiffEnd.java
+ test/jdk/sun/security/tools/jarsigner/EC.java
+ test/jdk/sun/security/tools/jarsigner/EmptyManifest.java
! test/jdk/sun/security/tools/jarsigner/EntriesOrder.java
+ test/jdk/sun/security/tools/jarsigner/JvIndex.java
+ test/jdk/sun/security/tools/jarsigner/NameClash.java
+ test/jdk/sun/security/tools/jarsigner/NewSize7.java
+ test/jdk/sun/security/tools/jarsigner/OldSig.java
+ test/jdk/sun/security/tools/jarsigner/OnlyManifest.java
! test/jdk/sun/security/tools/jarsigner/Options.java
+ test/jdk/sun/security/tools/jarsigner/PassType.java
+ test/jdk/sun/security/tools/jarsigner/PercentSign.java
- test/jdk/sun/security/tools/jarsigner/PercentSign.sh
+ test/jdk/sun/security/tools/jarsigner/SameName.java
+ test/jdk/sun/security/tools/jarsigner/WeakSize.java
- test/jdk/sun/security/tools/jarsigner/certpolicy.sh
- test/jdk/sun/security/tools/jarsigner/checkusage.sh
- test/jdk/sun/security/tools/jarsigner/collator.sh
- test/jdk/sun/security/tools/jarsigner/concise_jarsigner.sh
- test/jdk/sun/security/tools/jarsigner/crl.sh
- test/jdk/sun/security/tools/jarsigner/default_options.sh
- test/jdk/sun/security/tools/jarsigner/diffend.sh
- test/jdk/sun/security/tools/jarsigner/ec.sh
- test/jdk/sun/security/tools/jarsigner/emptymanifest.sh
- test/jdk/sun/security/tools/jarsigner/jvindex.sh
- test/jdk/sun/security/tools/jarsigner/nameclash.sh
- test/jdk/sun/security/tools/jarsigner/newsize7.sh
- test/jdk/sun/security/tools/jarsigner/oldsig.sh
- test/jdk/sun/security/tools/jarsigner/onlymanifest.sh
- test/jdk/sun/security/tools/jarsigner/passtype.sh
- test/jdk/sun/security/tools/jarsigner/samename.sh
- test/jdk/sun/security/tools/jarsigner/weaksize.sh
+ test/jdk/sun/security/tools/keytool/CloneKeyAskPassword.java
- test/jdk/sun/security/tools/keytool/CloneKeyAskPassword.sh
+ test/jdk/sun/security/tools/keytool/DefaultOptions.java
+ test/jdk/sun/security/tools/keytool/EmptySubject.java
+ test/jdk/sun/security/tools/keytool/FileInHelp.java
+ test/jdk/sun/security/tools/keytool/ImportReadAll.java
+ test/jdk/sun/security/tools/keytool/KeyAlg.java
+ test/jdk/sun/security/tools/keytool/NewHelp.java
+ test/jdk/sun/security/tools/keytool/NoExtNPE.java
- test/jdk/sun/security/tools/keytool/NoExtNPE.sh
+ test/jdk/sun/security/tools/keytool/Resource.java
+ test/jdk/sun/security/tools/keytool/SecretKeyKS.java
- test/jdk/sun/security/tools/keytool/SecretKeyKS.sh
+ test/jdk/sun/security/tools/keytool/SecurityToolsTest.java
+ test/jdk/sun/security/tools/keytool/SelfIssued.java
+ test/jdk/sun/security/tools/keytool/StandardAlgName.java
- test/jdk/sun/security/tools/keytool/StandardAlgName.sh
! test/jdk/sun/security/tools/keytool/StorePasswords.java
- test/jdk/sun/security/tools/keytool/StorePasswordsByShell.sh
+ test/jdk/sun/security/tools/keytool/TryStore.java
- test/jdk/sun/security/tools/keytool/default_options.sh
- test/jdk/sun/security/tools/keytool/emptysubject.sh
- test/jdk/sun/security/tools/keytool/file-in-help.sh
! test/jdk/sun/security/tools/keytool/i18n.html
! test/jdk/sun/security/tools/keytool/i18n.java
- test/jdk/sun/security/tools/keytool/i18n.sh
- test/jdk/sun/security/tools/keytool/importreadall.sh
- test/jdk/sun/security/tools/keytool/keyalg.sh
- test/jdk/sun/security/tools/keytool/newhelp.sh
- test/jdk/sun/security/tools/keytool/resource.sh
- test/jdk/sun/security/tools/keytool/selfissued.sh
- test/jdk/sun/security/tools/keytool/trystore.sh
! test/lib/jdk/test/lib/SecurityTools.java

Changeset: 5de08c55
Author:    Christoph Langer <clanger at openjdk.org>
Date:      2021-10-05 11:00:15 +0000
URL:       https://git.openjdk.java.net/jdk11u/commit/5de08c55fb3e26abd9a63c832a15f98769daed8c

8230067: Add optional automatic retry when running jtreg tests

Reviewed-by: mdoerr
Backport-of: 72cb073c095014f6babab50c20029ba9f2986f1b

! doc/testing.html
! doc/testing.md
! make/RunTests.gmk

Changeset: ddc3288b
Author:    Reka Kovacs <rekakovacs at microsoft.com>
Committer: Christoph Langer <clanger at openjdk.org>
Date:      2021-10-05 16:12:47 +0000
URL:       https://git.openjdk.java.net/jdk11u/commit/ddc3288b8cde25001244fee81896c98b1237affc

8250810: Push missing parts of JDK-8248817

Push changes from JDK-8248817 that were accidentally excluded from the commit.

Co-authored-by: Ludovic Henry <luhenry at openjdk.org>
Co-authored-by: Bernhard Urban-Forster <burban at openjdk.org>
Reviewed-by: aph, mdoerr
Backport-of: a4eaf9536c272862b5ec856bf263679be09bddc9

! src/hotspot/os/windows/os_windows.cpp
! src/hotspot/os_cpu/windows_x86/thread_windows_x86.cpp

Changeset: ceccbc35
Author:    Christoph Langer <clanger at openjdk.org>
Date:      2021-10-06 07:00:00 +0000
URL:       https://git.openjdk.java.net/jdk11u/commit/ceccbc35b9e1cff019ccaae666e823b9b9dfea3e

8224829: AsyncSSLSocketClose.java has timing issue

Reviewed-by: mdoerr
Backport-of: a4277e56c8e4cbf801d1e00daec79b37ad4fdb84

! src/java.base/share/classes/sun/security/ssl/DTLSInputRecord.java
! src/java.base/share/classes/sun/security/ssl/DTLSOutputRecord.java
! src/java.base/share/classes/sun/security/ssl/InputRecord.java
! src/java.base/share/classes/sun/security/ssl/OutputRecord.java
! src/java.base/share/classes/sun/security/ssl/SSLEngineOutputRecord.java
! src/java.base/share/classes/sun/security/ssl/SSLSocketImpl.java
! src/java.base/share/classes/sun/security/ssl/SSLSocketOutputRecord.java
! src/java.base/share/classes/sun/security/ssl/TransportContext.java
! test/jdk/javax/net/ssl/SSLSocket/Tls13PacketSize.java
+ test/jdk/sun/security/ssl/SSLSocketImpl/BlockedAsyncClose.java

Changeset: 5865defe
Author:    Aleksey Shipilev <shade at openjdk.org>
Date:      2021-10-06 07:18:39 +0000
URL:       https://git.openjdk.java.net/jdk11u/commit/5865defe89ef1cd7ff8d14cd6ce06a6749d0b1a0

8272914: Create hotspot:tier2 and hotspot:tier3 test groups

Reviewed-by: clanger
Backport-of: 5ee5dd9b18fb5adc563a65bd1a29779eda675d61

! test/hotspot/jtreg/TEST.groups

Changeset: 2897522c
Author:    Aleksey Shipilev <shade at openjdk.org>
Date:      2021-10-06 07:19:28 +0000
URL:       https://git.openjdk.java.net/jdk11u/commit/2897522c052a5e2560c450e4c7239b088d5c19ff

8273606: Zero: SPARC64 build fails with si_band type mismatch

Reviewed-by: clanger
Backport-of: 241ac89f120f9bcfef65962aa05b51b9f847c4ce

! src/hotspot/os/posix/os_posix.cpp

Changeset: 5d6ddbed
Author:    Aleksey Shipilev <shade at openjdk.org>
Date:      2021-10-06 07:20:14 +0000
URL:       https://git.openjdk.java.net/jdk11u/commit/5d6ddbed6ffdd199025cbb33ec492d29c602cce2

8272783: Epsilon: Refactor tests to improve performance

Reviewed-by: clanger
Backport-of: 7f80683cfeee3c069f48d5bce45fa92b2381b518

! test/hotspot/jtreg/gc/epsilon/TestAlignment.java
! test/hotspot/jtreg/gc/epsilon/TestAlwaysPretouch.java
! test/hotspot/jtreg/gc/epsilon/TestArraycopyCheckcast.java
! test/hotspot/jtreg/gc/epsilon/TestByteArrays.java
! test/hotspot/jtreg/gc/epsilon/TestClasses.java
! test/hotspot/jtreg/gc/epsilon/TestDieDefault.java
! test/hotspot/jtreg/gc/epsilon/TestDieWithHeapDump.java
! test/hotspot/jtreg/gc/epsilon/TestDieWithOnError.java
! test/hotspot/jtreg/gc/epsilon/TestElasticTLAB.java
! test/hotspot/jtreg/gc/epsilon/TestElasticTLABDecay.java
! test/hotspot/jtreg/gc/epsilon/TestEpsilonEnabled.java
! test/hotspot/jtreg/gc/epsilon/TestHelloWorld.java
! test/hotspot/jtreg/gc/epsilon/TestLogTrace.java
! test/hotspot/jtreg/gc/epsilon/TestManyThreads.java
! test/hotspot/jtreg/gc/epsilon/TestMaxTLAB.java
! test/hotspot/jtreg/gc/epsilon/TestMemoryMXBeans.java
! test/hotspot/jtreg/gc/epsilon/TestMemoryPools.java
! test/hotspot/jtreg/gc/epsilon/TestObjects.java
! test/hotspot/jtreg/gc/epsilon/TestPrintHeapSteps.java
! test/hotspot/jtreg/gc/epsilon/TestRefArrays.java
! test/hotspot/jtreg/gc/epsilon/TestUpdateCountersSteps.java

Changeset: 45d63a86
Author:    Goetz Lindenmaier <goetz at openjdk.org>
Date:      2021-10-06 07:28:46 +0000
URL:       https://git.openjdk.java.net/jdk11u/commit/45d63a86326bd9cf36458b2c536b5f6fd8375d5e

8223140: Clean-up in 'ok_to_convert()'

Simplify logic in function. Added precond/postcond macros.

Reviewed-by: shade
Backport-of: f4faee7bae5bdfcae994e95dc7e4e53ba850db98

! src/hotspot/share/opto/loopnode.cpp
! src/hotspot/share/opto/node.hpp
! src/hotspot/share/opto/subnode.cpp

Changeset: 456d4fbb
Author:    Goetz Lindenmaier <goetz at openjdk.org>
Date:      2021-10-06 07:29:57 +0000
URL:       https://git.openjdk.java.net/jdk11u/commit/456d4fbbee8cbf513efc04198ce4c7f57439781f

8159597: [TEST_BUG] closed/javax/swing/JPopupMenu/4760494/bug4760494.java leaves key pressed

Backport-of: 604005d65c5a3183b32bd13eabad4ddddf7c628f

+ test/jdk/javax/swing/JPopupMenu/4760494/bug4760494.java

Changeset: 89aec263
Author:    Goetz Lindenmaier <goetz at openjdk.org>
Date:      2021-10-06 07:32:58 +0000
URL:       https://git.openjdk.java.net/jdk11u/commit/89aec263e970f428a9c9cffb15a35fd42f3874a9

8075909: [TEST_BUG] The regression-swing case failed as it does not have the 'Open' button when select 'subdir' folder with NimbusLAF

Backport-of: 0e9c5aedc84eb254b386c7f03963125f7aacb888

! test/jdk/javax/swing/JFileChooser/6698013/bug6698013.java

Changeset: f5e2a9d2
Author:    Goetz Lindenmaier <goetz at openjdk.org>
Date:      2021-10-06 07:33:59 +0000
URL:       https://git.openjdk.java.net/jdk11u/commit/f5e2a9d2d38fd04552dbd364b9af0b9be4557fde

8263897: compiler/c2/aarch64/TestVolatilesSerial.java failed with "java.lang.RuntimeException: Wrong method"

Reviewed-by: aph
Backport-of: f84b52b84dc7ba1921b3845ae696fa9896ba4136

! test/hotspot/jtreg/compiler/c2/aarch64/TestVolatiles.java

Changeset: f248cebc
Author:    Goetz Lindenmaier <goetz at openjdk.org>
Date:      2021-10-06 07:35:20 +0000
URL:       https://git.openjdk.java.net/jdk11u/commit/f248cebc7f60c54b3ddcea4b1f7202074d5c32a0

8265173: [test] divert spurious log output away from stream under test in ProcessBuilder Basic test

Backport-of: 7b61a426e0837bde4885bd53397bba6b0939382f

! test/jdk/java/lang/ProcessBuilder/Basic.java

Changeset: 76511ca1
Author:    Goetz Lindenmaier <goetz at openjdk.org>
Date:      2021-10-06 07:36:04 +0000
URL:       https://git.openjdk.java.net/jdk11u/commit/76511ca1535997f64bd3da793213fcaa45c5684a

8159904: [TEST_BUG] Failure on solaris of java/awt/Window/MultiWindowApp/MultiWindowAppTest.java

Reviewed-by: clanger
Backport-of: 6ce52e62770c5e1933cbe26bb18b47d6099e4a70

! test/jdk/java/awt/Window/MultiWindowApp/MultiWindowAppTest.java

Changeset: 620726ee
Author:    Goetz Lindenmaier <goetz at openjdk.org>
Date:      2021-10-06 07:36:52 +0000
URL:       https://git.openjdk.java.net/jdk11u/commit/620726eed66134573f103227a6f07205d973336e

8262438: sun/security/ssl/SSLLogger/LoggingFormatConsistency.java failed with "SocketException: Socket is closed"

Backport-of: b2a2ddff44331475ba17051936dbc402cc6a3f46

! test/jdk/sun/security/ssl/SSLLogger/LoggingFormatConsistency.java

Changeset: 7f5569cd
Author:    Goetz Lindenmaier <goetz at openjdk.org>
Date:      2021-10-06 07:49:04 +0000
URL:       https://git.openjdk.java.net/jdk11u/commit/7f5569cde36cd84894863d22e9b4901708749fae

8254802: ThrowingPushPromisesAsStringCustom.java fails in "try throwing in GET_BODY"

Backport-of: 566d77a2ae4ee8830c989ea03f7bc6923df061cd

! test/jdk/java/net/httpclient/http2/server/Http2TestServerConnection.java

Changeset: 881ae696
Author:    Martin Doerr <mdoerr at openjdk.org>
Date:      2021-10-06 09:18:10 +0000
URL:       https://git.openjdk.java.net/jdk11u/commit/881ae69689ad96a7d637375a04da0dab3c70190d

8274326: [macos] Ensure initialisation of sun/lwawt/macosx/CAccessibility in JavaComponentAccessibility.m

Backport-of: 2cffe4c8e0b8e6d5843b7e9545e4b4408c56465c

! src/java.desktop/macosx/native/libawt_lwawt/awt/JavaComponentAccessibility.m

Changeset: 58fe5e84
Author:    Martin Doerr <mdoerr at openjdk.org>
Date:      2021-10-06 09:18:46 +0000
URL:       https://git.openjdk.java.net/jdk11u/commit/58fe5e841fe2638f0c87634f3a60bdece4b5f142

8273924: ArrayIndexOutOfBoundsException thrown in java.util.JapaneseImperialCalendar.add()

Backport-of: d39aad92308fbc28bd2de164e331062ebf62da85

! src/java.base/share/classes/sun/util/calendar/BaseCalendar.java
! test/jdk/java/util/Calendar/CalendarTestScripts/JapaneseTests.java
! test/jdk/java/util/Calendar/CalendarTestScripts/japanese/japanese_add.cts

Changeset: b1bab7ff
Author:    Martin Doerr <mdoerr at openjdk.org>
Date:      2021-10-06 09:19:35 +0000
URL:       https://git.openjdk.java.net/jdk11u/commit/b1bab7ffe1565ab51ba8512d288b20f4163efc0c

8272570: C2: crash in PhaseCFG::global_code_motion

Backport-of: 0f428ca533627e758cdca599d4589f39c21e27b6

! src/hotspot/share/opto/lcm.cpp
+ test/hotspot/jtreg/compiler/regalloc/TestGCMRecalcPressureNodes.java

Changeset: cbdb8c2f
Author:    Jonathan Dowland <jdowland at openjdk.org>
Committer: Christoph Langer <clanger at openjdk.org>
Date:      2021-10-07 06:00:19 +0000
URL:       https://git.openjdk.java.net/jdk11u/commit/cbdb8c2f3e2d86ccf9258c7a3bcc1c9b51097793

8272581: sun/security/pkcs11/Provider/MultipleLogins.sh fails after JDK-8266182

Reviewed-by: clanger
Backport-of: a199ebc0175f9882f051551cff9ce08016f204a4

! test/jdk/sun/security/pkcs12/KeytoolOpensslInteropTest.java
= test/lib/jdk/test/lib/security/OpensslArtifactFetcher.java

Changeset: b367f677
Author:    Jonathan Dowland <jdowland at openjdk.org>
Committer: Christoph Langer <clanger at openjdk.org>
Date:      2021-10-07 06:01:09 +0000
URL:       https://git.openjdk.java.net/jdk11u/commit/b367f677c76126dc83dbef71d7c84f3d51e873f4

8272180: Upgrade JSZip from v3.6.0 to v3.7.1
8272828: Add correct licenses to jszip.md

Reviewed-by: goetz

! src/jdk.javadoc/share/classes/jdk/javadoc/internal/doclets/formats/html/resources/jquery/jszip/dist/jszip.js
! src/jdk.javadoc/share/classes/jdk/javadoc/internal/doclets/formats/html/resources/jquery/jszip/dist/jszip.min.js
! src/jdk.javadoc/share/legal/jszip.md

Changeset: 57aa3d83
Author:    Aleksey Shipilev <shade at openjdk.org>
Date:      2021-10-07 06:50:15 +0000
URL:       https://git.openjdk.java.net/jdk11u/commit/57aa3d83759a1d92084df4298bd7144ad1c1e660

8199138: Add RISC-V support to Zero

Backport-of: edc4ffe54b8c1f042e98c0ddb9dce757d88b01f4

! make/autoconf/platform.m4
! src/hotspot/os/linux/os_linux.cpp

Changeset: cbd6132b
Author:    Aleksey Shipilev <shade at openjdk.org>
Date:      2021-10-07 06:54:57 +0000
URL:       https://git.openjdk.java.net/jdk11u/commit/cbd6132b18c478458e56278d0b478ac830c2fd9b

8273314: Add tier4 test groups

Reviewed-by: clanger
Backport-of: 1f8af524ffe2d2d1469d8f07887b1f61c6e4d7b8

! test/hotspot/jtreg/TEST.groups
! test/jaxp/TEST.groups
! test/jdk/TEST.groups
! test/langtools/TEST.groups

Changeset: 441b4de7
Author:    Aleksey Shipilev <shade at openjdk.org>
Date:      2021-10-07 06:55:42 +0000
URL:       https://git.openjdk.java.net/jdk11u/commit/441b4de79c15182db0b894b7c47db4d7b9c07b9a

8274083: Update testing docs to mention tiered testing

Backport-of: 971aa353aae51222ca33ebfdd61b91672a6c871a

! doc/testing.html
! doc/testing.md

Changeset: f859729e
Author:    Martin Doerr <mdoerr at openjdk.org>
Date:      2021-10-07 08:20:27 +0000
URL:       https://git.openjdk.java.net/jdk11u/commit/f859729ebfaadb4e4dfa137652e0a12896057900

8274381: missing CAccessibility definitions in JNI code

Backport-of: a9981fb0ff11965128761ffd1d8fae1c44c7b9fb

! src/java.desktop/macosx/native/libawt_lwawt/awt/JavaAccessibilityUtilities.m

Changeset: 4c8eba0b
Author:    Martin Doerr <mdoerr at openjdk.org>
Date:      2021-10-07 08:21:21 +0000
URL:       https://git.openjdk.java.net/jdk11u/commit/4c8eba0b026695348380e0831faf900facc6b446

8271341: Opcode() != Op_If && Opcode() != Op_RangeCheck) || outcnt() == 2 assert failure with Test7179138_1.java

Backport-of: 99fb12c798ad24cc4a671a666930ba42c3cd10c9

! src/hotspot/share/opto/stringopts.cpp
! test/hotspot/jtreg/compiler/c2/Test7179138_1.java

Changeset: bd3c8948
Author:    Martin Doerr <mdoerr at openjdk.org>
Date:      2021-10-07 08:21:56 +0000
URL:       https://git.openjdk.java.net/jdk11u/commit/bd3c89482e2238391dbcd0d5d3a31ca8863e27f5

8270886: Crash in PhaseIdealLoop::verify_strip_mined_scheduling

Backport-of: 6afcf5f5a243be10e2ec61229819c298ccce3267

! src/hotspot/share/opto/compile.cpp
+ test/hotspot/jtreg/compiler/c2/TestRenumberLiveNodesInfiniteLoop.java

Changeset: 8bef4125
Author:    Martin Doerr <mdoerr at openjdk.org>
Date:      2021-10-07 08:22:39 +0000
URL:       https://git.openjdk.java.net/jdk11u/commit/8bef41257566e6a2c28df93b4a6b39326fb53b81

8271340: Crash PhaseIdealLoop::clone_outer_loop

Backport-of: 2abf3b3b2743947282300ee8416611559e49fca0

! src/hotspot/share/gc/shenandoah/c2/shenandoahSupport.cpp
! src/hotspot/share/gc/shenandoah/c2/shenandoahSupport.hpp
! src/hotspot/share/opto/cfgnode.cpp
+ test/hotspot/jtreg/compiler/loopopts/TestInfiniteLoopCCP.java

Changeset: 63367e32
Author:    Zhengyu Gu <zgu at openjdk.org>
Date:      2021-10-07 12:24:00 +0000
URL:       https://git.openjdk.java.net/jdk11u/commit/63367e324b02ca4fb5a542dc3c3ec4cdc568c4c0

8273342: Null pointer dereference in classFileParser.cpp:2817

Backport-of: 8609ea55acdcc203408f58f7bf96ea9228aef613

! src/hotspot/share/runtime/fieldDescriptor.cpp

Changeset: eeab2f19
Author:    Martin Doerr <mdoerr at openjdk.org>
Date:      2021-10-08 09:26:34 +0000
URL:       https://git.openjdk.java.net/jdk11u/commit/eeab2f199907d3ad0dc9e08170241cc0986ac82b

8273229: Update OS detection code to recognize Windows Server 2022

Backport-of: c2e015c3c1a2274112bb8e6671a85bc7fb624fde

! src/hotspot/os/windows/os_windows.cpp
! src/java.base/windows/native/libjava/java_props_md.c

Changeset: f79ceaf4
Author:    Martin Doerr <mdoerr at openjdk.org>
Date:      2021-10-08 09:27:36 +0000
URL:       https://git.openjdk.java.net/jdk11u/commit/f79ceaf471df544fbb9b4d44ae7f23c8b7a23933

8273498: compiler/c2/Test7179138_1.java timed out

Backport-of: 84f6cb4ae418af42e0c8d38ef3070411ba0de18a

! test/hotspot/jtreg/compiler/c2/Test7179138_1.java

Changeset: a88c7386
Author:    Martin Doerr <mdoerr at openjdk.org>
Date:      2021-10-08 09:29:38 +0000
URL:       https://git.openjdk.java.net/jdk11u/commit/a88c7386e8191590f6410fbe985159e40ed40785

8271287: jdk/jshell/CommandCompletionTest.java fails with "lists don't have the same size expected"

Backport-of: 71788c69dbae854331f3393044dab458c906045f

! test/langtools/jdk/jshell/CommandCompletionTest.java

Changeset: 158c0a8c
Author:    Martin Doerr <mdoerr at openjdk.org>
Date:      2021-10-08 09:35:09 +0000
URL:       https://git.openjdk.java.net/jdk11u/commit/158c0a8c16974e1eb2021fd36f9032fb0f150a34

8274642: jdk/jshell/CommandCompletionTest.java fails with NoSuchElementException after JDK-8271287

Backport-of: 47262670f371923a704ec521da40010c2a46be5a

! test/langtools/jdk/jshell/CommandCompletionTest.java

Changeset: 65cab1ec
Author:    Jonathan Dowland <jdowland at openjdk.org>
Committer: Christoph Langer <clanger at openjdk.org>
Date:      2021-10-10 21:11:50 +0000
URL:       https://git.openjdk.java.net/jdk11u/commit/65cab1ec757283d0fe122c32efea98af5281b215

8198616: java/awt/Focus/6378278/InputVerifierTest.java fails on mac

Backport-of: dd8286e2f3f7e0a4b0b07b4ea84be4d36414c330

! test/jdk/ProblemList.txt
! test/jdk/java/awt/Focus/6378278/InputVerifierTest.java

Changeset: 84fc3b73
Author:    Goetz Lindenmaier <goetz at openjdk.org>
Date:      2021-10-11 05:46:00 +0000
URL:       https://git.openjdk.java.net/jdk11u/commit/84fc3b73f9aa8e8ba916d7057b6120929d6a1e2e

8211148: var in implicit lambdas shouldn't be accepted for source < 11

Backport-of: 2589e9733e054c164a64112db80e25fefd6dd222

! src/jdk.compiler/share/classes/com/sun/tools/javac/code/Source.java
! src/jdk.compiler/share/classes/com/sun/tools/javac/parser/JavacParser.java
! src/jdk.compiler/share/classes/com/sun/tools/javac/resources/compiler.properties
+ test/langtools/tools/javac/diags/examples/VarInImplicitLambda.java
! test/langtools/tools/javac/lambda/LambdaParserTest.java
! test/langtools/tools/javac/var_implicit_lambda/VarInImplicitLambdaNegTest01.java
! test/langtools/tools/javac/var_implicit_lambda/VarInImplicitLambdaNegTest01.out
+ test/langtools/tools/javac/var_implicit_lambda/VarInImplicitLambdaNegTest01_source10.out

Changeset: 75b513fb
Author:    Goetz Lindenmaier <goetz at openjdk.org>
Date:      2021-10-11 05:47:08 +0000
URL:       https://git.openjdk.java.net/jdk11u/commit/75b513fba7d01241a0db78a15d2c4a47ef648c74

8243543: jtreg test security/infra/java/security/cert/CertPathValidator/certification/BuypassCA.java fails

Backport-of: 45abbeed2f4f2899a3c1595b0cd8e573990a16fa

! test/jdk/ProblemList.txt
! test/jdk/security/infra/java/security/cert/CertPathValidator/certification/BuypassCA.java

Changeset: d66464e9
Author:    Christoph Langer <clanger at openjdk.org>
Date:      2021-10-11 08:20:15 +0000
URL:       https://git.openjdk.java.net/jdk11u/commit/d66464e94bed86dc6dbd2e736b26d74948f940d9

8237589: Fix copyright header formatting

Reviewed-by: shade

! src/java.base/share/classes/sun/security/ssl/DTLSInputRecord.java
! src/java.base/share/classes/sun/security/ssl/SSLExtensions.java
! src/java.security.jgss/share/classes/sun/security/krb5/internal/PAData.java
! src/java.xml/share/classes/com/sun/org/apache/xerces/internal/dom/AttrImpl.java
! src/java.xml/share/classes/com/sun/org/apache/xerces/internal/dom/DocumentTypeImpl.java
! src/java.xml/share/classes/com/sun/org/apache/xerces/internal/dom/NodeImpl.java
! src/java.xml/share/classes/com/sun/org/apache/xml/internal/serialize/ElementState.java
! src/java.xml/share/classes/com/sun/org/apache/xml/internal/serialize/HTMLSerializer.java
! src/java.xml/share/classes/com/sun/org/apache/xml/internal/serialize/HTMLdtd.java
! src/java.xml/share/classes/com/sun/org/apache/xml/internal/serialize/SerializerFactory.java
! src/jdk.jconsole/share/classes/sun/tools/jconsole/Worker.java
! test/hotspot/gtest/gc/shared/test_preservedMarks.cpp
! test/hotspot/gtest/memory/test_chunkManager.cpp
! test/hotspot/gtest/memory/test_is_metaspace_obj.cpp
! test/hotspot/jtreg/compiler/aot/scripts/java.base-list.txt
! test/hotspot/jtreg/compiler/intrinsics/base64/TestBase64.java
! test/hotspot/jtreg/runtime/CommandLine/UnrecognizedVMOption.java
! test/hotspot/jtreg/runtime/NMT/HugeArenaTracking.java
! test/hotspot/jtreg/runtime/logging/LoaderConstraintsTest.java
! test/hotspot/jtreg/vmTestbase/nsk/share/README
! test/hotspot/jtreg/vmTestbase/nsk/share/jni/README
! test/hotspot/jtreg/vmTestbase/nsk/share/native/README
! test/jdk/java/awt/Dialog/MakeWindowAlwaysOnTop/MakeWindowAlwaysOnTop.java
! test/jdk/java/lang/Character/UnicodeBlock/OptimalMapSize.java
! test/jdk/java/net/DatagramSocket/InterruptibleDatagramSocket.java
! test/jdk/java/net/httpclient/security/0.policy
! test/jdk/java/net/httpclient/security/1.policy
! test/jdk/java/net/httpclient/security/10.policy
! test/jdk/java/net/httpclient/security/11.policy
! test/jdk/java/net/httpclient/security/12.policy
! test/jdk/java/net/httpclient/security/14.policy
! test/jdk/java/net/httpclient/security/15.policy
! test/jdk/java/net/httpclient/security/16.policy
! test/jdk/java/net/httpclient/security/17.policy
! test/jdk/java/net/httpclient/security/2.policy
! test/jdk/java/net/httpclient/security/3.policy
! test/jdk/java/net/httpclient/security/4.policy
! test/jdk/java/net/httpclient/security/5.policy
! test/jdk/java/net/httpclient/security/6.policy
! test/jdk/java/net/httpclient/security/7.policy
! test/jdk/java/net/httpclient/security/8.policy
! test/jdk/java/net/httpclient/security/9.policy
! test/jdk/java/net/httpclient/security/filePerms/allpermissions.policy
! test/jdk/java/net/httpclient/security/filePerms/nopermissions.policy
! test/jdk/java/net/httpclient/websocket/security/httpclient.policy
! test/jdk/java/nio/file/Files/SetLastModifiedTime.java
! test/jdk/java/security/Provider/TestClient.java
! test/jdk/java/security/Provider/TestProvider.java
! test/jdk/java/time/test/java/time/format/TestUnicodeExtension.java
! test/jdk/java/util/Calendar/GenericTimeZoneNamesTest.java
! test/jdk/java/util/Comparator/BasicTest.java
! test/jdk/java/util/Locale/bcp47u/DisplayNameTests.java
! test/jdk/java/util/jar/JarFile/Constructor.java
! test/langtools/jdk/jshell/CustomEditor.java
! test/langtools/tools/javac/lvti/harness/LocalVariableInferenceTester.java
! test/langtools/tools/jdeps/modules/patches/java/sql/NonNull.java
! test/nashorn/script/basic/JDK-8193371.js

Changeset: 82491fd2
Author:    Christoph Langer <clanger at openjdk.org>
Date:      2021-10-11 08:57:24 +0000
URL:       https://git.openjdk.java.net/jdk11u/commit/82491fd2d2c694cc75ad2aef504ea596ea6d36de

7105119: [TEST_BUG] [macosx] In test UIDefaults.toString() must be called with the invokeLater()

Backport-of: 84fc4850a674f0f688cca2c6856e5656428707fc

! test/jdk/ProblemList.txt
! test/jdk/javax/swing/MultiUIDefaults/4300666/bug4300666.java

Changeset: 4e63adb5
Author:    Christoph Langer <clanger at openjdk.org>
Date:      2021-10-11 09:09:45 +0000
URL:       https://git.openjdk.java.net/jdk11u/commit/4e63adb56e6469a158d64fcc5e04045deb51ec60

8242793: Incorrect copyright header in ContinuousCallSiteTargetChange.java

Backport-of: 25cd1774a76e6e7519291f2e18ab25c2c76df255

! test/hotspot/jtreg/compiler/jsr292/ContinuousCallSiteTargetChange.java

Changeset: bcee700e
Author:    Goetz Lindenmaier <goetz at openjdk.org>
Date:      2021-10-11 11:57:07 +0000
URL:       https://git.openjdk.java.net/jdk11u/commit/bcee700e708f689b8ca83e9d65e9971542d363c9

8273961: jdk/nio/zipfs/ZipFSTester.java fails if file path contains '+' character

Reviewed-by: mdoerr
Backport-of: 7f78803b0926ea194334ad9b3c9f06cbe17a83dd

! test/jdk/jdk/nio/zipfs/ZipFSTester.java

Changeset: 9512c471
Author:    Goetz Lindenmaier <goetz at openjdk.org>
Date:      2021-10-11 11:58:15 +0000
URL:       https://git.openjdk.java.net/jdk11u/commit/9512c471e9ab0830d8d5b2275803f59a0f073fcb

8273826: Correct Manifest file name and NPE checks

Reviewed-by: mdoerr
Backport-of: 03a8d342b86e720d3cba08d540182b4ab161fba3

! src/java.base/share/classes/java/util/jar/JarFile.java
! src/java.base/share/classes/java/util/jar/JarInputStream.java
! src/java.base/share/classes/java/util/jar/JarVerifier.java
! src/java.base/share/classes/sun/security/util/ManifestEntryVerifier.java
+ test/jdk/sun/security/tools/jarsigner/warnings/LowerCaseManifest.java

Changeset: aa5d5f31
Author:    Goetz Lindenmaier <goetz at openjdk.org>
Date:      2021-10-12 06:36:59 +0000
URL:       https://git.openjdk.java.net/jdk11u/commit/aa5d5f31751c2d5ad453322871798a0055bee563

8245147: Refactor and improve utility of test/langtools/tools/javac/versions/Versions.java

Reviewed-by: mdoerr
Backport-of: 6cbf57aa377c3e6edf79f31927e5cea69ef90a1d

! test/langtools/tools/javac/versions/Versions.java

Changeset: fc2646b1
Author:    Jie Fu <jiefu at openjdk.org>
Committer: Christoph Langer <clanger at openjdk.org>
Date:      2021-10-12 06:53:03 +0000
URL:       https://git.openjdk.java.net/jdk11u/commit/fc2646b1c20b7f6749a7199a7f188ce90a5d8d47

8274329: Fix non-portable HotSpot code in MethodMatcher::parse_method_pattern

Reviewed-by: kvn
Backport-of: c833b4d130fabfa6a6f3a38313f76eb7e392c6a5

! src/hotspot/share/compiler/methodMatcher.cpp

Changeset: 7410b74f
Author:    Goetz Lindenmaier <goetz at openjdk.org>
Date:      2021-10-12 07:21:52 +0000
URL:       https://git.openjdk.java.net/jdk11u/commit/7410b74fd7a4c6b2bbc5665de83baa4fad80193f

8273646: Add openssl from path variable also in to Default System Openssl Path in OpensslArtifactFetcher

Backport-of: a5108a605e6a1e427d90dbeeb8630a3d01d6b405

! test/lib/jdk/test/lib/security/OpensslArtifactFetcher.java

Changeset: 2a028c46
Author:    Goetz Lindenmaier <goetz at openjdk.org>
Date:      2021-10-12 07:22:57 +0000
URL:       https://git.openjdk.java.net/jdk11u/commit/2a028c46833216d9fa69fce0b152eca4627ae7cc

8180568: Refactor javax/crypto shell tests to plain java tests

Reviewed-by: mdoerr
Backport-of: 20ad42897427483a4a62e1de7e78d4620eb9e240

! test/jdk/javax/crypto/CryptoPermissions/TestExemption.java
- test/jdk/javax/crypto/CryptoPermissions/TestExemption.sh
- test/jdk/javax/crypto/SecretKeyFactory/FailOverTest.sh
+ test/jdk/javax/crypto/SecretKeyFactory/TestFailOver.java

Changeset: d336b240
Author:    Reka Kovacs <rekakovacs at microsoft.com>
Committer: Christoph Langer <clanger at openjdk.org>
Date:      2021-10-12 19:53:22 +0000
URL:       https://git.openjdk.java.net/jdk11u/commit/d336b240c36474c4ccbceabc33fdf7cbe618da85

8253015: Aarch64: Move linux code out from generic CPU feature detection
8255716: AArch64: Regression: JVM crashes if manually offline a core

Co-authored-by: Bernhard Urban-Forster <burban at openjdk.org>
Reviewed-by: akozlov, mdoerr
Backport-of: ec9bee68660acd6abf0b4dd4023ae69514542256

! src/hotspot/cpu/aarch64/vm_version_aarch64.cpp
! src/hotspot/cpu/aarch64/vm_version_aarch64.hpp
! src/hotspot/os_cpu/linux_aarch64/vm_version_linux_aarch64.cpp

Changeset: 0a71d8e3
Author:    Christoph Langer <clanger at openjdk.org>
Date:      2021-10-12 19:54:11 +0000
URL:       https://git.openjdk.java.net/jdk11u/commit/0a71d8e3f628bf0e3436ed6d33fa95aa9da73a20

8221305: java/awt/FontMetrics/MaxAdvanceIsMax.java fails on MacOS + Solaris

Backport-of: a040c56dd9a31f9b051d312166932e33c171c93a

! test/jdk/ProblemList.txt
- test/jdk/java/awt/FontMetrics/MaxAdvanceIsMax.java

Changeset: 4940e2e8
Author:    Goetz Lindenmaier <goetz at openjdk.org>
Date:      2021-10-13 07:18:23 +0000
URL:       https://git.openjdk.java.net/jdk11u/commit/4940e2e8d85f2eef88c6132923b165253c13aa73

8137101: [TEST_BUG] javax/swing/plaf/basic/BasicHTML/4251579/bug4251579.java failure due to timing

Reviewed-by: mdoerr
Backport-of: dcdb1b6aaad912669614ff52ad2b0b8804f204d1

! test/jdk/javax/swing/plaf/basic/BasicHTML/4251579/bug4251579.java

Changeset: 844c504b
Author:    Martin Doerr <mdoerr at openjdk.org>
Date:      2021-10-13 07:27:47 +0000
URL:       https://git.openjdk.java.net/jdk11u/commit/844c504bc18fa8a79ceacc6b6f235650f5e643bf

8271459: C2: Missing NegativeArraySizeException when creating StringBuilder with negative capacity

Reviewed-by: goetz
Backport-of: 3953e0774c59c5e936e752aa08b6b6778e232994

! src/hotspot/share/opto/stringopts.cpp

Changeset: 45575033
Author:    Goetz Lindenmaier <goetz at openjdk.org>
Date:      2021-10-13 07:29:06 +0000
URL:       https://git.openjdk.java.net/jdk11u/commit/455750334bf42089987321f0dea4539195d173eb

8269656: The test test/langtools/tools/javac/versions/Versions.java has duplicate test cycles

Backport-of: 04b73bc4e022740122463ef70791ef276ac9b34d

! test/langtools/tools/javac/versions/Versions.java

Changeset: 15384ad5
Author:    Ao Qi <aoqi at openjdk.org>
Committer: Christoph Langer <clanger at openjdk.org>
Date:      2021-10-13 09:58:33 +0000
URL:       https://git.openjdk.java.net/jdk11u/commit/15384ad55a3e703a5f4bc0c802514603b2077656

8250888: nsk/jvmti/scenarios/general_functions/GF08/gf08t001/TestDriver.java fails

Reviewed-by: goetz
Backport-of: 5fedb69e66f55960bc334db951fc8224fea8489e

! test/hotspot/jtreg/vmTestbase/nsk/jvmti/scenarios/general_functions/GF08/gf08t001/TestDriver.java

Changeset: 15931e55
Author:    Ao Qi <aoqi at openjdk.org>
Committer: Christoph Langer <clanger at openjdk.org>
Date:      2021-10-13 09:59:34 +0000
URL:       https://git.openjdk.java.net/jdk11u/commit/15931e554a94289075b3364f88ebeb7552bfaa58

8230228: [TESTBUG] Several runtime/ErrorHandling tests may fail on some platforms

Prevent downgraded compilation tasks from recompiling.

Reviewed-by: goetz
Backport-of: 63dbcdc87456de230741767c298e72f428c34f47

! test/hotspot/jtreg/runtime/ErrorHandling/BadNativeStackInErrorHandlingTest.java
! test/hotspot/jtreg/runtime/ErrorHandling/ErrorFileRedirectTest.java
! test/hotspot/jtreg/runtime/ErrorHandling/SafeFetchInErrorHandlingTest.java
! test/hotspot/jtreg/runtime/ErrorHandling/TimeoutInErrorHandlingTest.java

Changeset: 90d1bcbb
Author:    Vladimir Kempik <vkempik at openjdk.org>
Date:      2021-10-14 06:05:43 +0000
URL:       https://git.openjdk.java.net/jdk11u/commit/90d1bcbb10536f84f690cacf28be7ff145198af9

8261071: AArch64: Refactor interpreter native wrappers

Backport-of: 682e78e89b35c05590a5bc490e87ae3cab864c02

! src/hotspot/cpu/aarch64/interpreterRT_aarch64.cpp
! src/hotspot/cpu/aarch64/interpreterRT_aarch64.hpp

Changeset: 968c21e2
Author:    Martin Doerr <mdoerr at openjdk.org>
Date:      2021-10-14 08:02:22 +0000
URL:       https://git.openjdk.java.net/jdk11u/commit/968c21e25844a6dc54400f8d270d378ac2ba591f

8272574: C2: assert(false) failed: Bad graph detected in build_loop_late

Backport-of: 16c3ad1ff4d9a0e21f15656c73a96a6c143c811a

! src/hotspot/share/opto/loopPredicate.cpp
! src/hotspot/share/opto/loopnode.hpp
! src/hotspot/share/opto/memnode.cpp
+ test/hotspot/jtreg/compiler/loopopts/TestLoopPredicateDep.java

Changeset: 167c9f06
Author:    Christoph Langer <clanger at openjdk.org>
Date:      2021-10-14 11:00:56 +0000
URL:       https://git.openjdk.java.net/jdk11u/commit/167c9f06c88d805c8a10a4c8f6370ba5216b48cc

8169953: JComboBox/8057893: ComboBoxEdited event is not fired! on Windows

Backport-of: 0d2cc3b449f62d48089a760ab3e17ecae388d02e

! test/jdk/ProblemList.txt

Changeset: dfb97b0f
Author:    Christoph Langer <clanger at openjdk.org>
Date:      2021-10-14 11:02:11 +0000
URL:       https://git.openjdk.java.net/jdk11u/commit/dfb97b0f987474559bb28326b5b088099e364e3d

8233642: [TESTBUG] JMenuBar test bug 4750590.java  fails on macos

Backport-of: 5f0d11e1e9fa4907a30737a22b6abafc1242e526

! test/jdk/ProblemList.txt

Changeset: 4bdcad59
Author:    Christoph Langer <clanger at openjdk.org>
Date:      2021-10-14 11:02:56 +0000
URL:       https://git.openjdk.java.net/jdk11u/commit/4bdcad59246bda146c8dfa603e266e3f07d8e360

8233643: [TESTBUG] JMenu test bug4515762.java fails on macos

Backport-of: 1f2f808794903c515b00909d34d0a496b43c0c20

! test/jdk/ProblemList.txt
! test/jdk/javax/swing/JMenu/4515762/bug4515762.java

Changeset: b3926db9
Author:    Christoph Langer <clanger at openjdk.org>
Date:      2021-10-14 11:03:49 +0000
URL:       https://git.openjdk.java.net/jdk11u/commit/b3926db99e03283d2f0e1cc5564bd4c22abe77ca

8233638: [TESTBUG] Swing test ScreenMenuBarInputTwice.java fails on macos

Backport-of: 823d1d222fd45d32a330d11bf7b007f00093cdcc

! test/jdk/ProblemList.txt
! test/jdk/javax/swing/JMenuItem/8139169/ScreenMenuBarInputTwice.java

Changeset: 596677e8
Author:    Jie Fu <jiefu at openjdk.org>
Committer: Goetz Lindenmaier <goetz at openjdk.org>
Date:      2021-10-14 12:22:35 +0000
URL:       https://git.openjdk.java.net/jdk11u/commit/596677e816783c08473c7fcee8b92f859f444622

8251155: HostIdentifier fails to canonicalize hostnames starting with digits

Reviewed-by: goetz
Backport-of: 5585e6f63a56fc1f54dafa066e6520498ba284ac

! src/jdk.internal.jvmstat/share/classes/sun/jvmstat/monitor/HostIdentifier.java
+ test/jdk/sun/tools/jps/TestJpsHostName.java

Changeset: 94893a52
Author:    Martin Doerr <mdoerr at openjdk.org>
Date:      2021-10-14 14:00:18 +0000
URL:       https://git.openjdk.java.net/jdk11u/commit/94893a5249eb39051d81352219a642ae3896dda5

8274840: Update OS detection code to recognize Windows 11

Backport-of: 97ea9dd2f24f9f1fb9b9345a4202a825ee28e014

! src/hotspot/os/windows/os_windows.cpp
! src/java.base/windows/native/libjava/java_props_md.c

Changeset: e2f83016
Author:    Yi Yang <yyang at openjdk.org>
Committer: Christoph Langer <clanger at openjdk.org>
Date:      2021-10-15 05:32:36 +0000
URL:       https://git.openjdk.java.net/jdk11u/commit/e2f830160feedcc6439fb35dde8b1ab6774d2848

8273790: Potential cyclic dependencies between Gregorian and CalendarSystem

Backport-of: ddc262746aea99050b9a6484f51c7ddb8f4bc991

! src/java.base/share/classes/sun/util/calendar/CalendarSystem.java
+ test/jdk/sun/util/calendar/CalendarSystemDeadLockTest.java

Changeset: 99ff2681
Author:    Martin Doerr <mdoerr at openjdk.org>
Date:      2021-10-15 08:23:59 +0000
URL:       https://git.openjdk.java.net/jdk11u/commit/99ff268130f355d293b704b876a4e64543070dd8

8239334: Tab Size does not work correctly in JTextArea with setLineWrap on

Backport-of: 3c72042627a02c2ad12a909fc76a082d902bc35d

! src/java.desktop/share/classes/javax/swing/text/WrappedPlainView.java
= test/jdk/javax/swing/JTextArea/TestTabSizeWithLineWrap.java

Changeset: fcb396fe
Author:    Martin Doerr <mdoerr at openjdk.org>
Date:      2021-10-15 08:58:06 +0000
URL:       https://git.openjdk.java.net/jdk11u/commit/fcb396fe52ddd594050cfae470c35ac96547ecb9

8211999: Window positioning bugs due to overlapping GraphicsDevice bounds (Windows/HiDPI)

Reviewed-by: serb
Backport-of: be635258fa0b7c25441ab23ff9ec0f86655dc5ca

! src/java.desktop/share/classes/java/awt/Robot.java
! src/java.desktop/share/classes/java/awt/peer/RobotPeer.java
! src/java.desktop/share/classes/sun/java2d/SunGraphicsEnvironment.java
! src/java.desktop/windows/classes/sun/awt/Win32GraphicsDevice.java
! src/java.desktop/windows/classes/sun/awt/windows/WComponentPeer.java
! src/java.desktop/windows/classes/sun/awt/windows/WDialogPeer.java
! src/java.desktop/windows/classes/sun/awt/windows/WFramePeer.java
! src/java.desktop/windows/classes/sun/awt/windows/WRobotPeer.java
! src/java.desktop/windows/classes/sun/awt/windows/WWindowPeer.java
! src/java.desktop/windows/native/libawt/windows/MouseInfo.cpp
! src/java.desktop/windows/native/libawt/windows/awt_Component.cpp
! src/java.desktop/windows/native/libawt/windows/awt_Component.h
! src/java.desktop/windows/native/libawt/windows/awt_Cursor.cpp
! src/java.desktop/windows/native/libawt/windows/awt_DnDDS.cpp
! src/java.desktop/windows/native/libawt/windows/awt_FileDialog.cpp
! src/java.desktop/windows/native/libawt/windows/awt_Frame.cpp
! src/java.desktop/windows/native/libawt/windows/awt_List.cpp
! src/java.desktop/windows/native/libawt/windows/awt_Win32GraphicsConfig.cpp
! src/java.desktop/windows/native/libawt/windows/awt_Win32GraphicsDevice.cpp
! src/java.desktop/windows/native/libawt/windows/awt_Win32GraphicsDevice.h
! src/java.desktop/windows/native/libawt/windows/awt_Window.cpp
! src/java.desktop/windows/native/libawt/windows/awt_Window.h
! src/java.desktop/windows/native/libawt/windows/awtmsg.h
+ test/jdk/java/awt/Component/SetComponentsBounds/SetComponentsBounds.java
! test/jdk/java/awt/EmbeddedFrame/EmbeddedFrameGrabTest/EmbeddedFrameGrabTest.java
! test/jdk/java/awt/Frame/MaximizedToOppositeScreen/MaximizedToOppositeScreenSmall.java
+ test/jdk/java/awt/FullScreen/FullscreenWindowProps/FullscreenWindowProps.java
+ test/jdk/java/awt/List/ListMultipleSelectTest/ListMultipleSelectTest.java
! test/jdk/java/awt/Multiscreen/MouseEventTest/MouseEventTest.java
! test/jdk/java/awt/Robot/CheckCommonColors/CheckCommonColors.java
! test/jdk/java/awt/Window/LocationAtScreenCorner/LocationAtScreenCorner.java
+ test/jdk/java/awt/Window/SlowMotion/SlowMotion.java
+ test/jdk/java/awt/Window/WindowSizeDifferentScreens/WindowSizeDifferentScreens.java
! test/jdk/java/awt/dnd/Button2DragTest/Button2DragTest.java
! test/jdk/javax/swing/JTextArea/8149849/DNDTextToScaledArea.java

Changeset: 2c4ab768
Author:    Vladimir Kempik <vkempik at openjdk.org>
Date:      2021-10-18 07:06:27 +0000
URL:       https://git.openjdk.java.net/jdk11u/commit/2c4ab7689898806dcbfe7054babf7d4934f319a3

8267652: c2 loop unrolling by 8 results in reading memory past array

Reviewed-by: mdoerr
Backport-of: 0c99b192588b04aceaa27cda9cb42b45f95adffe

! src/hotspot/cpu/x86/x86.ad

Changeset: 4a9c879e
Author:    Christoph Langer <clanger at openjdk.org>
Date:      2021-10-18 07:07:33 +0000
URL:       https://git.openjdk.java.net/jdk11u/commit/4a9c879e66e501b43fcd459e656437df35a16834

8233553: [TESTBUG] JSpinner test bug4973721.java fails on MacOS

Backport-of: 9ae8b32dee4255de577c67385376a559a04e902b

! test/jdk/ProblemList.txt
! test/jdk/javax/swing/JSpinner/4973721/bug4973721.java

Changeset: a2628a0d
Author:    Christoph Langer <clanger at openjdk.org>
Date:      2021-10-18 15:28:14 +0000
URL:       https://git.openjdk.java.net/jdk11u/commit/a2628a0d3b79056ba9dfbaf3046a693ade8d903e

8233552: [TESTBUG] JTable Test bug7068740.java fails on MacOS

Backport-of: 15433df97f23ee40b75a9d59cddc350cf4caaeeb

! test/jdk/ProblemList.txt

Changeset: b8c6841e
Author:    Christoph Langer <clanger at openjdk.org>
Date:      2021-10-18 15:36:19 +0000
URL:       https://git.openjdk.java.net/jdk11u/commit/b8c6841ee7405ce64b219a26269ce3d1a603b563

8233566: [TESTBUG] KeyboardFocusManager tests failing on MacoS

Backport-of: 85822a50d590876b7a329762a06322a70910789b

! test/jdk/ProblemList.txt
! test/jdk/java/awt/KeyboardFocusmanager/TypeAhead/EnqueueWithDialogTest/EnqueueWithDialogTest.java

Changeset: 611d729e
Author:    Christoph Langer <clanger at openjdk.org>
Date:      2021-10-18 15:46:58 +0000
URL:       https://git.openjdk.java.net/jdk11u/commit/611d729e752ddb0dae25743026f63a5ba91f8161

8233647: [TESTBUG] JColorChooser/Test8051548.java is failing on macos

Backport-of: 342e9f88cdbafb629e3d14da8ecd0f357358dddb

! test/jdk/ProblemList.txt

Changeset: 49681f25
Author:    Christoph Langer <clanger at openjdk.org>
Date:      2021-10-18 15:52:33 +0000
URL:       https://git.openjdk.java.net/jdk11u/commit/49681f25f435e32b33c138bb0a038e373f7c3ed2

8239827: The test OpenByUNCPathNameTest.java should be changed to be manual

Backport-of: 7cc3ba5f9b188e5dd298dbcde3934d08b6101032

! test/jdk/ProblemList.txt
! test/jdk/java/awt/Desktop/OpenByUNCPathNameTest/OpenByUNCPathNameTest.java

Changeset: fac11d38
Author:    Christoph Langer <clanger at openjdk.org>
Date:      2021-10-19 05:12:35 +0000
URL:       https://git.openjdk.java.net/jdk11u/commit/fac11d38bcc4b3d906692dc92463f9a1f3dd7bb4

8233550: [TESTBUG] JTree tests fail regularly on MacOS

Backport-of: 04b3bf60245a1f1780ab906da14fc59466b4b381

! test/jdk/ProblemList.txt
! test/jdk/javax/swing/JTree/4330357/bug4330357.java
! test/jdk/javax/swing/JTree/4908142/bug4908142.java
! test/jdk/javax/swing/JTree/4927934/bug4927934.java

Changeset: 8faf1c7b
Author:    Christoph Langer <clanger at openjdk.org>
Date:      2021-10-19 05:20:04 +0000
URL:       https://git.openjdk.java.net/jdk11u/commit/8faf1c7bb908fb5f39c9361a4004d9fd5f793ec3

8198624: java/awt/KeyboardFocusmanager/TypeAhead/SubMenuShowTest/SubMenuShowTest.html fails on mac

Reviewed-by: mdoerr
Backport-of: fe6aa29326db76cb0eb04a874ae5ca8c14034f29

! test/jdk/ProblemList.txt
- test/jdk/java/awt/KeyboardFocusmanager/TypeAhead/SubMenuShowTest/SubMenuShowTest.html
! test/jdk/java/awt/KeyboardFocusmanager/TypeAhead/SubMenuShowTest/SubMenuShowTest.java

Changeset: bdf1d027
Author:    bobpengxie <bobpengxie at tencent.com>
Committer: Christoph Langer <clanger at openjdk.org>
Date:      2021-10-19 05:30:59 +0000
URL:       https://git.openjdk.java.net/jdk11u/commit/bdf1d027cb6597e24d15ceb3f0ec0824ad480475

8274293: Build failure on macOS with Xcode 13.0 as vfork is deprecated

Reviewed-by: phh
Backport-of: 252aaa9249d8979366b37d59487b5b039d923e35

! src/java.base/unix/native/libjava/ProcessImpl_md.c

Changeset: 777ec9b7
Author:    Martin Doerr <mdoerr at openjdk.org>
Date:      2021-10-19 08:26:14 +0000
URL:       https://git.openjdk.java.net/jdk11u/commit/777ec9b7577bb499a7f8a754b6a15fa364499892

8270280: security/infra/java/security/cert/CertPathValidator/certification/LetsEncryptCA.java  OCSP response error

Backport-of: f4b3ee5dca8cfdc2fbb8ee64a1e8cdb8894b0061

! test/jdk/ProblemList.txt
! test/jdk/security/infra/java/security/cert/CertPathValidator/certification/LetsEncryptCA.java

Changeset: 2847e345
Author:    Jonathan Dowland <jdowland at openjdk.org>
Committer: Martin Doerr <mdoerr at openjdk.org>
Date:      2021-10-19 08:42:32 +0000
URL:       https://git.openjdk.java.net/jdk11u/commit/2847e345590336f095fa646901d776feae2e0c88

8275131: Exceptions after a touchpad gesture on macOS

Backport-of: 89999f70e06b41704c7c5b0f9a19582f90806a10

! src/java.desktop/macosx/native/libawt_lwawt/awt/AWTWindow.m

Changeset: b1221190
Author:    Joshua Cao <joshcao at amazon.com>
Committer: Christoph Langer <clanger at openjdk.org>
Date:      2021-10-20 05:27:19 +0000
URL:       https://git.openjdk.java.net/jdk11u/commit/b12211907f1b3edc00c5561cda343fbf0821be4c

8252051: Make mlvmJvmtiUtils strncpy uses GCC 10.x friendly

Reviewed-by: phh

! test/hotspot/jtreg/vmTestbase/vm/mlvm/share/mlvmJvmtiUtils.c

Changeset: bab6d940
Author:    Christoph Langer <clanger at openjdk.org>
Date:      2021-10-20 05:34:59 +0000
URL:       https://git.openjdk.java.net/jdk11u/commit/bab6d940e0cba845f42bf59d51290bc4b9322d00

8233559: [TESTBUG] TestNimbusOverride.java is failing on macos

Backport-of: c6386188143df45bb0a2e72812075cad22c650e4

! test/jdk/ProblemList.txt
! test/jdk/javax/swing/plaf/nimbus/TestNimbusOverride.java

Changeset: d5017c37
Author:    Ao Qi <aoqi at openjdk.org>
Committer: Christoph Langer <clanger at openjdk.org>
Date:      2021-10-20 05:35:44 +0000
URL:       https://git.openjdk.java.net/jdk11u/commit/d5017c378c0624a6e2f1ec00fa5333b01f4c6fb2

8270517: Add Zero support for LoongArch

Backport-of: e92e2fd4e0bc805d8f7d70f632cce0282eb1809b

! make/autoconf/build-aux/config.guess
! make/autoconf/platform.m4
! src/hotspot/os/linux/os_linux.cpp

Changeset: eb03bf78
Author:    Vladimir Kempik <vkempik at openjdk.org>
Date:      2021-10-20 06:12:26 +0000
URL:       https://git.openjdk.java.net/jdk11u/commit/eb03bf7804417db57e27802cc9479255e54dc429

8261075: Create stubRoutines.inline.hpp with SafeFetch implementation

Reviewed-by: phh, mdoerr
Backport-of: b955f85e03bafe8ce39677d0af06bf1ceb7e2cbb

! src/hotspot/os/aix/os_aix.cpp
! src/hotspot/os/windows/os_windows.cpp
! src/hotspot/share/gc/shared/oopStorage.cpp
! src/hotspot/share/runtime/objectMonitor.cpp
! src/hotspot/share/runtime/os.cpp
+ src/hotspot/share/runtime/safefetch.hpp
! src/hotspot/share/runtime/stubRoutines.cpp
! src/hotspot/share/runtime/stubRoutines.hpp
! src/hotspot/share/utilities/vmError.cpp
! test/hotspot/gtest/runtime/test_safefetch.cpp

Changeset: f62113af
Author:    Martin Doerr <mdoerr at openjdk.org>
Date:      2021-10-20 08:03:46 +0000
URL:       https://git.openjdk.java.net/jdk11u/commit/f62113af14315a2c2f53af56b3833cfc7e415c82

8207936: TestZipFile failed with java.lang.AssertionError exception

Backport-of: 65455ff60b4f33996c698029e0b2cff65c7f45f5

! test/jdk/java/util/zip/ZipFile/TestZipFile.java

Changeset: 0f9d6bf0
Author:    Martin Doerr <mdoerr at openjdk.org>
Date:      2021-10-20 08:05:04 +0000
URL:       https://git.openjdk.java.net/jdk11u/commit/0f9d6bf062b37d4b8336902db78df650a1509e61

8247510: typo in IllegalHandshakeMessage

Backport-of: 1faed205dfbc47def8fa9eb5db4dc337db53b9dc

! test/jdk/javax/net/ssl/SSLEngine/IllegalHandshakeMessage.java

Changeset: 1772cf1e
Author:    Martin Doerr <mdoerr at openjdk.org>
Date:      2021-10-20 08:05:51 +0000
URL:       https://git.openjdk.java.net/jdk11u/commit/1772cf1ec7d8216c687e181163e3931265100a97

8272708: [Test]: Cleanup: test/jdk/security/infra/java/security/cert/CertPathValidator/certification/BuypassCA.java no longer needs ocspEnabled

Backport-of: 4bd37c315333325b69db8d55c0c3aaf74c95024f

! test/jdk/security/infra/java/security/cert/CertPathValidator/certification/BuypassCA.java

Changeset: 93e98ad4
Author:    Martin Doerr <mdoerr at openjdk.org>
Date:      2021-10-20 08:06:39 +0000
URL:       https://git.openjdk.java.net/jdk11u/commit/93e98ad4f018ce1c8a811403b6cc3e1de43ec9d9

8266579: Update test/jdk/java/lang/ProcessHandle/PermissionTest.java & test/jdk/java/sql/testng/util/TestPolicy.java

Backport-of: fcedfc8a3b4299372f195cae036129dcd7b740ea

! test/jdk/java/lang/ProcessHandle/PermissionTest.java
! test/jdk/java/sql/testng/util/TestPolicy.java

Changeset: cdc48c27
Author:    Martin Doerr <mdoerr at openjdk.org>
Date:      2021-10-20 08:07:24 +0000
URL:       https://git.openjdk.java.net/jdk11u/commit/cdc48c27c668302f516b485efd5b8e37ffca1d87

8256201: java/awt/FullScreen/FullscreenWindowProps/FullscreenWindowProps.java failed

Backport-of: 1c0b490c28c0d24642fbb7d72c26535b46ed3c27

! test/jdk/java/awt/FullScreen/FullscreenWindowProps/FullscreenWindowProps.java

Changeset: b4493031
Author:    Martin Doerr <mdoerr at openjdk.org>
Date:      2021-10-20 08:08:19 +0000
URL:       https://git.openjdk.java.net/jdk11u/commit/b449303166fcf4d7d16f651087bb49bffd1b5cc7

8171998: javax/swing/JMenu/4692443/bug4692443.java fails on Windows

Backport-of: 4acf634d053121d84a294e5a0f5358ff0dea573e

! test/jdk/ProblemList.txt
! test/jdk/javax/swing/JMenu/4692443/bug4692443.java

Changeset: 5a2b2ac1
Author:    Martin Doerr <mdoerr at openjdk.org>
Date:      2021-10-20 08:09:06 +0000
URL:       https://git.openjdk.java.net/jdk11u/commit/5a2b2ac13b2729fce9d2dfc9d95351fc0ad9f73d

8198619: java/awt/Focus/FocusTraversalPolicy/ButtonGroupLayoutTraversal/ButtonGroupLayoutTraversalTest.java fails on mac

Backport-of: cf92693957584e4d4555f8c5f7783feaea2e5c07

! test/jdk/ProblemList.txt
! test/jdk/java/awt/Focus/FocusTraversalPolicy/ButtonGroupLayoutTraversal/ButtonGroupLayoutTraversalTest.java

Changeset: 4b6e4874
Author:    Martin Doerr <mdoerr at openjdk.org>
Date:      2021-10-20 08:09:50 +0000
URL:       https://git.openjdk.java.net/jdk11u/commit/4b6e4874320f40cf3b00297ab55d1f2455d05f87

8197800: Test java/awt/Focus/NonFocusableWindowTest/NoEventsTest.java fails on Windows

Backport-of: ca37be1ead40b3f407ae43330a1df0a1c3eb380e

! test/jdk/ProblemList.txt

Changeset: 1297c26c
Author:    Zhengyu Gu <zgu at openjdk.org>
Date:      2021-10-20 12:48:11 +0000
URL:       https://git.openjdk.java.net/jdk11u/commit/1297c26cfb1155ca6ebd826ae7ce244c9fa0f62b

8275051: Shenandoah: Correct ordering of requested gc cause and gc request flag

Reviewed-by: phh
Backport-of: 1ab64143c06e33e23172dd77c39e434443347364

! src/hotspot/share/gc/shenandoah/shenandoahControlThread.cpp

Changeset: 00255bd4
Author:    Vladimir Kempik <vkempik at openjdk.org>
Date:      2021-10-21 05:55:49 +0000
URL:       https://git.openjdk.java.net/jdk11u/commit/00255bd4fb4496b6a929a3f787171d416a51ff90

8263068: Rename safefetch.hpp to safefetch.inline.hpp

Reviewed-by: mdoerr
Backport-of: 0bc45625b0980c090e09edf73aa4800e20605035

! src/hotspot/os/aix/os_aix.cpp
! src/hotspot/os/windows/os_windows.cpp
! src/hotspot/share/gc/shared/oopStorage.cpp
! src/hotspot/share/runtime/objectMonitor.cpp
! src/hotspot/share/runtime/os.cpp
= src/hotspot/share/runtime/safefetch.inline.hpp
! src/hotspot/share/runtime/stubRoutines.cpp
! src/hotspot/share/utilities/vmError.cpp
! test/hotspot/gtest/runtime/test_safefetch.cpp

Changeset: 25c33bc9
Author:    Ao Qi <aoqi at openjdk.org>
Committer: Christoph Langer <clanger at openjdk.org>
Date:      2021-10-21 05:56:58 +0000
URL:       https://git.openjdk.java.net/jdk11u/commit/25c33bc9a571d81d1a2efaa74b5fe585ba1d334b

8239422: [TESTBUG] compiler/c1/TestPrintIRDuringConstruction.java failed when C1 is disabled

Skip test if C1 is not available.

Backport-of: eef02376bd29ef224566bdf9040967bb09b8f887

! test/hotspot/jtreg/compiler/c1/TestPrintIRDuringConstruction.java

Changeset: 5495b791
Author:    Christoph Langer <clanger at openjdk.org>
Date:      2021-10-25 07:18:52 +0000
URL:       https://git.openjdk.java.net/jdk11u/commit/5495b791d600ecb37f8ad12ff195ddfc10430161

8220575: Correctly format test URI's that contain a retrieved IPv6 address

Reviewed-by: mdoerr
Backport-of: 0c2b7c4fc3549bb2c44777093fa6588c9da451e1

! test/jdk/com/sun/net/httpserver/TestLogging.java
! test/jdk/com/sun/net/httpserver/bugs/6725892/Test.java
! test/jdk/com/sun/net/httpserver/bugs/B6373555.java
! test/jdk/com/sun/net/httpserver/bugs/B6401598.java
! test/jdk/java/net/HttpCookie/ExpiredCookieTest.java
! test/jdk/java/net/HttpURLConnection/NoProxyTest.java
! test/jdk/java/net/ProxySelector/NullSelector.java
! test/jdk/java/net/ResponseCache/Test2.java
! test/jdk/java/net/URLClassLoader/closetest/CloseTest.java
! test/jdk/java/net/URLConnection/TimeoutTest.java
! test/jdk/java/net/URLPermission/OpenURL.java
! test/jdk/java/net/httpclient/LargeResponseContent.java
! test/jdk/sun/net/www/http/KeepAliveCache/KeepAliveTimerThread.java
! test/jdk/sun/net/www/protocol/http/6550798/test.java
! test/jdk/sun/net/www/protocol/http/B6890349.java
! test/jdk/sun/net/www/protocol/http/B8012625.java
! test/jdk/sun/net/www/protocol/http/NoNTLM.java
! test/jdk/sun/net/www/protocol/http/RedirectOnPost.java
! test/jdk/sun/net/www/protocol/http/ResponseCacheStream.java
! test/jdk/sun/net/www/protocol/http/RetryUponTimeout.java
! test/jdk/sun/net/www/protocol/http/SetChunkedStreamingMode.java
! test/jdk/sun/net/www/protocol/http/UserAgent.java
! test/jdk/sun/net/www/protocol/https/HttpsURLConnection/IPAddressDNSIdentities.java
! test/jdk/sun/net/www/protocol/https/HttpsURLConnection/IPAddressIPIdentities.java

Changeset: 73fd4dad
Author:    Martin Doerr <mdoerr at openjdk.org>
Date:      2021-10-25 08:28:29 +0000
URL:       https://git.openjdk.java.net/jdk11u/commit/73fd4dadba5ab3848d5da8aaad4332fd875995f9

8270116: Expand ButtonGroupLayoutTraversalTest.java to run in all LaFs, including Aqua on macOS

Backport-of: cb368802815c465f8eef7aa930d6cbb6540d0fa8

! test/jdk/java/awt/Focus/FocusTraversalPolicy/ButtonGroupLayoutTraversal/ButtonGroupLayoutTraversalTest.java

Changeset: cfb1bd22
Author:    Martin Doerr <mdoerr at openjdk.org>
Date:      2021-10-25 08:29:13 +0000
URL:       https://git.openjdk.java.net/jdk11u/commit/cfb1bd22eebb3780a8183b2239b24cd700e7a119

8233555: [TESTBUG] JRadioButton tests failing on MacoS

Backport-of: 227f99d394571331ffa40b0b6b9d9d61c90635dd

! test/jdk/ProblemList.txt

Changeset: 80e371c1
Author:    Martin Doerr <mdoerr at openjdk.org>
Date:      2021-10-25 08:29:54 +0000
URL:       https://git.openjdk.java.net/jdk11u/commit/80e371c1411d17339739731ac013c4f7716b5395

8233567: [TESTBUG] FocusSubRequestTest.java fails on macos

Backport-of: b90ad76d6b8a4b2096ae096252dead9626d7e09b

! test/jdk/ProblemList.txt
! test/jdk/java/awt/Focus/FocusSubRequestTest/FocusSubRequestTest.java

Changeset: e216ee64
Author:    Christoph Langer <clanger at openjdk.org>
Date:      2021-10-25 13:14:05 +0000
URL:       https://git.openjdk.java.net/jdk11u/commit/e216ee64c242b754c1de373d190edec8e823399c

8226514: Replace wildcard address with loopback or local host in tests - part 17

Improve test stabilty by getting rid of the wildcard address whenever possible.

Reviewed-by: stuefe, mdoerr
Backport-of: 2ad9f11d7763051fc8c2ed9175ddc9f4b329c636

! test/jdk/java/net/HttpCookie/IllegalCookieNameTest.java
! test/jdk/java/net/HttpURLConnection/SetAuthenticator/HTTPTest.java
! test/jdk/java/net/HttpURLConnection/SetAuthenticator/HTTPTestServer.java
! test/jdk/sun/net/ftp/FtpURLConnectionLeak.java
! test/jdk/sun/net/www/http/HttpClient/RetryPost.java
! test/jdk/sun/net/www/protocol/http/B5017051.java
! test/jdk/sun/net/www/protocol/http/B6296310.java
! test/jdk/sun/net/www/protocol/http/B6299712.java
! test/jdk/sun/net/www/protocol/http/NoNTLM.java
! test/jdk/sun/net/www/protocol/http/RedirectOnPost.java
! test/jdk/sun/net/www/protocol/http/UserAgent.java
! test/jdk/sun/net/www/protocol/http/ZoneId.java
! test/jdk/sun/net/www/protocol/https/NewImpl/JavaxHTTPSConnection.java
! test/lib/jdk/test/lib/net/URIBuilder.java

Changeset: 7c3f2d5a
Author:    Goetz Lindenmaier <goetz at openjdk.org>
Date:      2021-10-25 13:41:58 +0000
URL:       https://git.openjdk.java.net/jdk11u/commit/7c3f2d5a53d69e39d02f5de0e6fd07bbe88ffceb

Merge

Reviewed-by: clanger

! src/hotspot/share/code/dependencies.cpp
! src/hotspot/share/oops/instanceKlass.cpp
! src/java.base/share/classes/java/util/jar/JarFile.java
! src/java.base/share/classes/sun/security/ssl/DTLSInputRecord.java
! src/hotspot/share/code/dependencies.cpp
! src/hotspot/share/oops/instanceKlass.cpp
! src/java.base/share/classes/java/util/jar/JarFile.java
! src/java.base/share/classes/sun/security/ssl/DTLSInputRecord.java

Changeset: 3fb75281
Author:    Martin Doerr <mdoerr at openjdk.org>
Date:      2021-10-26 08:16:27 +0000
URL:       https://git.openjdk.java.net/jdk11u/commit/3fb75281ec6889a5b15f4551b19be875becd8cf6

8274407: (tz) Update Timezone Data to 2021c
8274467: TestZoneInfo310.java fails with tzdata2021b
8274468: TimeZoneTest.java fails with tzdata2021b

Backport-of: 8ca084617f331b6af934179f3f776c8158da5bba

! make/data/tzdata/VERSION
! make/data/tzdata/africa
! make/data/tzdata/antarctica
! make/data/tzdata/asia
! make/data/tzdata/australasia
! make/data/tzdata/backward
! make/data/tzdata/europe
! make/data/tzdata/leapseconds
! make/data/tzdata/northamerica
! make/data/tzdata/southamerica
! make/data/tzdata/zone.tab
! src/java.base/share/classes/sun/util/calendar/ZoneInfoFile.java
! test/jdk/java/util/TimeZone/TimeZoneTest.java

Changeset: 7acc631f
Author:    Christoph Langer <clanger at openjdk.org>
Date:      2021-10-26 15:25:22 +0000
URL:       https://git.openjdk.java.net/jdk11u/commit/7acc631f8a53213f76a3fdfaaf384da1b9adcb29

8131745: java/lang/management/ThreadMXBean/AllThreadIds.java still fails intermittently

Reviewed-by: mdoerr
Backport-of: ea9aeda5ee89c02add8c69c1045659dd9eac5154

! test/jdk/ProblemList.txt
! test/jdk/java/lang/management/ThreadMXBean/AllThreadIds.java

Changeset: d8941d42
Author:    Christoph Langer <clanger at openjdk.org>
Date:      2021-10-26 15:44:44 +0000
URL:       https://git.openjdk.java.net/jdk11u/commit/d8941d426f5b48bb9107d9aac059fcb07d17cd5d

8246807: Incorrect copyright header in TimeZoneDatePermissionCheck.sh

Reviewed-by: shade

! test/jdk/java/util/TimeZone/TimeZoneDatePermissionCheck.sh

Changeset: 243fd309
Author:    Christoph Langer <clanger at openjdk.org>
Date:      2021-10-26 15:52:21 +0000
URL:       https://git.openjdk.java.net/jdk11u/commit/243fd3090b76d8c2d41fa5362199cd1e582ef8a4

8198623: java/awt/KeyboardFocusmanager/TypeAhead/EnqueueWithDialogButtonTest/EnqueueWithDialogButtonTest.java fails on mac

Backport-of: 3c472b67006122a49ee5e9def53eacae9bbc864a

! test/jdk/ProblemList.txt
! test/jdk/java/awt/KeyboardFocusmanager/TypeAhead/EnqueueWithDialogButtonTest/EnqueueWithDialogButtonTest.java
! test/jdk/java/awt/KeyboardFocusmanager/TypeAhead/FreezeTest/FreezeTest.java

Changeset: 352672f5
Author:    Goetz Lindenmaier <goetz at openjdk.org>
Date:      2021-10-27 06:40:00 +0000
URL:       https://git.openjdk.java.net/jdk11u/commit/352672f5cfff78aeeaae64122723ce5d3db54665

8197811: Test java/awt/Choice/PopupPosTest/PopupPosTest.java fails on Windows

Reviewed-by: mdoerr
Backport-of: d1c8c9eabbc420df19b07efc5e8adc85556079fb

! test/jdk/ProblemList.txt
! test/jdk/java/awt/Choice/PopupPosTest/PopupPosTest.java

Changeset: 8a9cda2d
Author:    Alexey Pavlyutkin <apavlyutkin at azul.com>
Committer: Yuri Nesterenko <yan at openjdk.org>
Date:      2021-10-28 06:38:50 +0000
URL:       https://git.openjdk.java.net/jdk11u/commit/8a9cda2d84513ab49a54e1d2a7b530f0bae05c61

8190753: (zipfs): Accessing a large entry (> 2^31 bytes) leads to a negative initial size for ByteArrayOutputStream

Reviewed-by: mdoerr
Backport-of: c3d8e9228d0558a2ce3e093c105c61ea7af2e1d1

! src/jdk.zipfs/share/classes/jdk/nio/zipfs/ZipFileSystem.java
+ test/jdk/jdk/nio/zipfs/LargeCompressedEntrySizeTest.java
+ test/jdk/jdk/nio/zipfs/ZipFSOutputStreamTest.java

Changeset: 9cc66169
Author:    Goetz Lindenmaier <goetz at openjdk.org>
Date:      2021-10-28 07:32:30 +0000
URL:       https://git.openjdk.java.net/jdk11u/commit/9cc661690ceb5822844dccf59412e566e3433a83

8274779: HttpURLConnection: HttpClient and HttpsClient incorrectly check request method when set to POST

Backport-of: 45ce06c9f3e9bee7d4bda313c38f0f0e8786a4db

! src/java.base/share/classes/sun/net/www/http/HttpClient.java
! src/java.base/share/classes/sun/net/www/protocol/https/HttpsClient.java
+ test/jdk/sun/net/www/http/RequestMethodCheck/RequestMethodEquality.java
+ test/jdk/sun/net/www/http/RequestMethodCheck/java.base/sun/net/www/http/HttpClientAccess.java

Changeset: 43f27bef
Author:    Goetz Lindenmaier <goetz at openjdk.org>
Date:      2021-10-28 07:33:43 +0000
URL:       https://git.openjdk.java.net/jdk11u/commit/43f27bef42332d16bd6f2ed682c30cf09c39950a

8262844: (fs) FileStore.supportsFileAttributeView might return false negative in case of ext3

Backport-of: 8d3de4b1bdb5dc13bb7724596dc2123ba05bbb81

! src/java.base/linux/classes/sun/nio/fs/LinuxFileStore.java

Changeset: fd22289a
Author:    Severin Gehwolf <sgehwolf at openjdk.org>
Date:      2021-10-28 08:20:57 +0000
URL:       https://git.openjdk.java.net/jdk11u/commit/fd22289a851a645c09f63229469decfb7b3ee450

8275713: TestDockerMemoryMetrics test fails on recent runc

Reviewed-by: mbaesken

! test/jdk/jdk/internal/platform/docker/MetricsMemoryTester.java

Changeset: d2fb3075
Author:    Christoph Langer <clanger at openjdk.org>
Date:      2021-10-29 07:29:35 +0000
URL:       https://git.openjdk.java.net/jdk11u/commit/d2fb30759f1ba30469e6ba75b5ac6eb343a41b62

8219986: Change to Xcode 10.1 for building on Macosx at Oracle

Reviewed-by: mdoerr
Backport-of: 53adab6857492905246c024b80a27bb989a996e3

! make/conf/jib-profiles.js
= make/devkit/createMacosxDevkit.sh
- make/devkit/createMacosxDevkit6.sh

Changeset: 1c90fe05
Author:    Martin Doerr <mdoerr at openjdk.org>
Date:      2021-10-29 08:26:50 +0000
URL:       https://git.openjdk.java.net/jdk11u/commit/1c90fe054360b3a05eab8ffca6cd2b3ed7a749aa

8256202: Some tweaks for jarsigner tests PosixPermissionsTest and SymLinkTest

Reviewed-by: clanger
Backport-of: 1e9a432d59fa3fb3d038c83c88fd7eeb3052960c

! test/jdk/sun/security/tools/jarsigner/PosixPermissionsTest.java
! test/jdk/sun/security/tools/jarsigner/SymLinkTest.java

Changeset: 4a997288
Author:    Christoph Langer <clanger at openjdk.org>
Date:      2021-10-29 10:35:07 +0000
URL:       https://git.openjdk.java.net/jdk11u/commit/4a99728820bf35b44bca09d0b3deabc8981898ae

8249195: Change to Xcode 11.3.1 for building on Macos at Oracle

Reviewed-by: mdoerr
Backport-of: 097720cce5bc44555507fdb031c6f78134c0cfbf

! make/conf/jib-profiles.js
! make/devkit/createMacosxDevkit.sh

Changeset: ff65591f
Author:    Christoph Langer <clanger at openjdk.org>
Date:      2021-10-29 14:54:22 +0000
URL:       https://git.openjdk.java.net/jdk11u/commit/ff65591f05fb05ac2db020f7a04b35ac31988dae

8199529: javax/swing/text/Utilities/8142966/SwingFontMetricsTest.java fails on windows

Reviewed-by: phh
Backport-of: 1ce6ec6a28ab530f04ebbed04f92f2f9bd9a7a6f

! test/jdk/ProblemList.txt
! test/jdk/javax/swing/text/Utilities/8142966/SwingFontMetricsTest.java

Changeset: 363ab5f8
Author:    Christoph Langer <clanger at openjdk.org>
Date:      2021-10-29 21:45:42 +0000
URL:       https://git.openjdk.java.net/jdk11u/commit/363ab5f885664413f7a8138f437d2a43b7fc6253

8233635: [TESTBUG] ProgressMonitorEscapeKeyPress.java fails on macos

Backport-of: 38636a8c9674f637a6529ad68b6983a388b4bf7a

! test/jdk/ProblemList.txt

Changeset: 36e54fbd
Author:    Christoph Langer <clanger at openjdk.org>
Date:      2021-10-30 08:33:46 +0000
URL:       https://git.openjdk.java.net/jdk11u/commit/36e54fbd936cebfa8e66483d0daa4d22dcc3100a

7151826: [TEST_BUG] [macosx] The test javax/swing/JPopupMenu/4966112/bug4966112.java not for mac

Backport-of: 4d9f20734791b30000547e90171191ae690ed245

! test/jdk/ProblemList.txt
! test/jdk/javax/swing/JPopupMenu/4966112/bug4966112.java



More information about the jdk-updates-changes mailing list