[modules-dev] JPRT: job notification - FAILED with job 2007-07-10-225725.daemon.ws

JPRT Administrator jprtadm at jprt-web.SFBay.Sun.COM
Tue Jul 10 16:15:44 PDT 2007


JPRT: job notification - FAILED with job 2007-07-10-225725.daemon.ws

Failure reason:  Test target failure:  linux_i586-product-c2-java/module

JPRT Job ID:            2007-07-10-225725.daemon.ws
JPRT System Used:       sfbay
JPRT Version Used:      08 June 2007 - Name Your Poison Day
Job URL:
  http://javaweb.sfbay/jdk/jprt/archive/2007/07/2007-07-10-225725.daemon.ws
User:                   daemon
Email:                  modules-dev at openjdk.java.net
Release:                jdk1.7.0
Job Source:             Source Tree:
  /net/shimmer.sfbay/export/home/jsr277/ws/{make,src}
File List:              {.}
Command Line:           jprt submit -stree ../ws -ot
  '.*linux_i586.*product.*' -noquickabort -email modules-dev at openjdk.java.net
  -rtests '*-*-c2-java/module' -rtests '*-*-c2-sun/module'
Job submitted at:       Tue-22:57:25-GMT
Total time in queue:    18m 18s
Job started at:         Tue-23:00:20-GMT
Job finished at:        Tue-23:15:43-GMT
Job run time:           15m 23s
Job state:              FAILED
Job fail/kill comment:   Test target failure:
  linux_i586-product-c2-java/module
Job flags:              
Bundles:                USE: jprt install 2007-07-10-225725.daemon.ws

HINT: Use 'jprt rerun -comment <arg>2007-07-10-225725.daemon.ws' to rerun
this job if you suspect bogus results.

User Comments:
null

Build (Release:jdk1.7.0 Boot:<jdk1.6.0> Import:<jdk1.7.0>):
linux_i586_2.4.9-product                         success(11m 24s elapsed)

Tests:
linux_i586-product-c2-jvm98                      success(02m 04s elapsed)
linux_i586-product-c2-java/module                 FAILED(02m 26s elapsed)
linux_i586-product-c2-sun/module                 success(    55s elapsed)

------------------------------------------------------------------------------
linux_i586-product-c2-java/module (details from log file)
/net/jprt-web.sfbay/jprt/archive/2007/07/2007-07-10-225725.daemon.ws/logs/linux_i586-product-c2-java_module-test.log
http://javaweb.sfbay/jdk/jprt/archive/2007/07/2007-07-10-225725.daemon.ws//logs/linux_i586-product-c2-java_module-test.log
Test results: passed: 12; failed: 2
Report written to /tmp/jprt/temp/P1/T/225725.daemon/source/test/JTREG_OUTPUT_linux_i686/java/module/JTreport/report.html
Results written to /tmp/jprt/temp/P1/T/225725.daemon/source/test/JTREG_OUTPUT_linux_i686/java/module/JTwork
Error: Some tests failed or other problems occurred.
---------------------------------------------------
Extracting passed and failed counts from jtreg output
Test results: passed: 12; failed: 2
ERROR: Failed pattern but no failed count in results
---------------------------------------------------
Summary: 
java/module/basic/BasicLauncherTests.java
  Passed. Execution successful
java/module/config/DefaultImportOverridePolicy/DefaultImportOverridePolicyTest.java
  Passed. Compilation successful
java/module/config/DefaultVisibilityPolicy/DefaultVisibilityPolicyTest.java
  Passed. Compilation successful
java/module/config/ImportOverridePolicyFile/ImportOverridePolicyFileTest.java
  Passed. Compilation successful
java/module/config/VisibilityPolicyFile/VisibilityPolicyFileTest.java
  Passed. Compilation successful
java/module/modinit/RunMTest.java
  Passed. Execution successful
java/module/query/QueryTest.java
  Passed. Execution successful
java/module/repository/LocalRepositoryTest.java
  Passed. Execution successful
java/module/repository/Test6574851.java
  Failed. Compilation failed
java/module/repository/Test6574852.java
  Failed. Compilation failed
java/module/repository/URLRepositoryTest.java
  Passed. Execution successful
java/module/repository/VisibilityPolicyTest.java
  Passed. Execution successful
java/module/version/VersionConstraintTest.java
  Passed. Execution successful
java/module/version/VersionTest.java
  Passed. Execution successful
---------------------------------------------------
JTREG TOTAL: passed=0 failed=1
zip -q -r /opt/jprt/temp/P1/T/225725.daemon/bundles/linux_i586-product-c2-java_module.zip
  JTREG_OUTPUT_linux_i686
JTREG FAILED
make: *** [tests] Error 1
###########################################################
#
# Finished: Tue Jul 10 16:14:53 PDT 2007
#
# Disk Space:
#   Filesystem           1k-blocks      Used Available Use% Mounted on
#   /dev/sda2             66357620  13547040  49439744  22% /
#
# returned exit code 2
#
###########################################################

------------------------------------------------------------------------------




For announcements on downtime and availability join the alias
  'jprt-announce at sun.com'. 
You can see the latest announcements at
  http://archives.central/tm/browse?jprt-announce. 
For suspected system problems, send mail to 'jprt-admin at sun.com'. 
The jprt how to document is available at
  http://javaweb.sfbay/jdk/jprt/dist/javadoc/jprt/doc-files/how-to.html.






More information about the modules-dev mailing list