Building Valhalla

Mani Sarkar sadhak001 at
Fri Oct 2 19:59:59 UTC 2015

Hi guys,

I get the below build error half way through build the valhalla build of

*ERROR: Failed module access verificationgmake[3]: *** [checkdeps] Error
1gmake[3]: Leaving directory
*** [verify-modules] Error 1gmake[2]: Leaving directory
*** [main] Error 1make[1]: Leaving directory
*** [images] Error 2Build step 'Execute shell' marked build as
failureArchiving artifacts*

Here's the link to the detailed logs -

Whats the fix to the verify modules issue ? Any flags that would help ?
There are a number of errors like "inaccessible reference:
valhalla.model3.Model3Converter (java.base) -> (jdk.compiler)".

For your info, I'm building from the
<> repo.


@theNeomatrix369 <>*  |  **Blog
<>**  |  *LJC Associate & LJC Advocate
(@adoptopenjdk & @adoptajsr programs)
*Meet-a-Project - *MutabilityDetector
<>*  |  **Bitbucket
<>* * |  **Github
<>* * |  **LinkedIn
*Come to Devoxx UK 2016:*

*Don't chase success, rather aim for "Excellence", and success will come
chasing after you!*

More information about the valhalla-dev mailing list