[Bug 607] New: [regression] backport of S6638712 lets the eucalyptus build fail

bugzilla-daemon at icedtea.classpath.org bugzilla-daemon at icedtea.classpath.org
Fri Dec 10 10:47:51 PST 2010


http://icedtea.classpath.org/bugzilla/show_bug.cgi?id=607

           Summary: [regression] backport of S6638712 lets the eucalyptus
                    build fail
           Product: IcedTea
           Version: 6-1.9.1
          Platform: all
               URL: https://launchpad.net/bugs/688522
        OS/Version: Linux
            Status: NEW
          Severity: normal
          Priority: P2
         Component: IcedTea6
        AssignedTo: unassigned at icedtea.classpath.org
        ReportedBy: doko at ubuntu.com


complete build log:
https://bugs.launchpad.net/ubuntu/+source/openjdk-6/+bug/688522/+attachment/1761764/+files/last_operation.log

/tmp/buildd/eucalyptus-2.0+bzr1241/clc/modules/msgs/src/main/java/com/eucalyptus/bootstrap/Bootstrap.java:46:
invalid inferred types for S; inferred type does not conform to declared
bound(s)
inferred: com.eucalyptus.util.Transition<A,B>
bound(s):
com.eucalyptus.util.Transition<A,com.eucalyptus.bootstrap.Bootstrap.Stage>
      return ( Transition<A, Bootstrap.Stage> ) Transition.anonymous( this, s,
c );
                                                                    ^
/tmp/buildd/eucalyptus-2.0+bzr1241/clc/modules/msgs/src/main/java/com/eucalyptus/bootstrap/Bootstrap.java:53:
invalid inferred types for S; inferred type does not conform to declared
bound(s)
inferred: com.eucalyptus.util.Transition<A,B>
bound(s): com.eucalyptus.util.Transition<A,java.lang.Comparable<? extends
java.lang.Comparable<?>>>
      return ( Transition<A,Comparable<? extends Comparable<?>>> )
Transition.anonymous( this, s, c );
                                                                               
       ^
/tmp/buildd/eucalyptus-2.0+bzr1241/clc/modules/msgs/src/main/java/com/eucalyptus/bootstrap/Bootstrap.java:255:
invalid inferred types for S; inferred type does not conform to declared
bound(s)
inferred: com.eucalyptus.util.Transition<A,B>
bound(s):
com.eucalyptus.util.Transition<com.eucalyptus.bootstrap.Bootstrap.Stage,com.eucalyptus.component.Lifecycles.State>
    Transition.anonymous( LoadConfigs.class ).transition( Stage.list( ) );
                        ^
/tmp/buildd/eucalyptus-2.0+bzr1241/clc/modules/msgs/src/main/java/com/eucalyptus/util/Transition.java:45:
invalid inferred types for S; inferred type does not conform to declared
bound(s)
inferred: com.eucalyptus.util.Transition<A,B>
bound(s): com.eucalyptus.util.Transition<A,B>
    Transition<A, B> anon = anonymous( from, to, r );
                                     ^
/tmp/buildd/eucalyptus-2.0+bzr1241/clc/modules/msgs/src/main/java/com/eucalyptus/component/Lifecycles.java:32:
invalid inferred types for S; inferred type does not conform to declared
bound(s)
inferred: com.eucalyptus.util.Transition<A,B>
bound(s):
com.eucalyptus.util.Transition<A,com.eucalyptus.component.Lifecycles.State>
      return ( Transition<A, Lifecycles.State> ) Transition.anonymous( this, s,
new Committor<A>( ) {
                                                                     ^
/tmp/buildd/eucalyptus-2.0+bzr1241/clc/modules/msgs/src/main/java/com/eucalyptus/component/Lifecycles.java:44:
invalid inferred types for S; inferred type does not conform to declared
bound(s)
inferred: com.eucalyptus.util.Transition<A,B>
bound(s):
com.eucalyptus.util.Transition<A,com.eucalyptus.component.Lifecycles.State>
      return ( Transition<A, Lifecycles.State> ) Transition.anonymous( this, s,
new Committor<A>( ) {
                                                                     ^
Note: Some input files use or override a deprecated API.
Note: Recompile with -Xlint:deprecation for details.
Note: Some input files use unchecked or unsafe operations.
Note: Recompile with -Xlint:unchecked for details.
6 errors
100 warnings


1 error


BUILD FAILED
/tmp/buildd/eucalyptus-2.0+bzr1241/clc/build.xml:90: The following error
occurred while executing this line:
/tmp/buildd/eucalyptus-2.0+bzr1241/clc/modules/module-inc.xml:133: The
following error occurred while executing this line:
/tmp/buildd/eucalyptus-2.0+bzr1241/clc/modules/module-inc.xml:151: The
following error occurred while executing this line:
/tmp/buildd/eucalyptus-2.0+bzr1241/clc/modules/module-inc.xml:158: Compilation
Failed

Total time: 10 seconds
make[2]: *** [build] Error 1
make[2]: Leaving directory `/tmp/buildd/eucalyptus-2.0+bzr1241/clc'
make[1]: *** [build] Error 2
make[1]: Leaving directory `/tmp/buildd/eucalyptus-2.0+bzr1241'


-- 
Configure bugmail: http://icedtea.classpath.org/bugzilla/userprefs.cgi?tab=email
------- You are receiving this mail because: -------
You are the assignee for the bug, or are watching the assignee.



More information about the distro-pkg-dev mailing list